{"text_format":"1","workbook":"xlsx","n_sheets":19,"sheets":["macro","Import","netto","diverses","altanl","SchAuf","preis","Start","Ausf","Farbe","Längen","S-Plan","art_system","typen","Sprachen","Schlüssel","Hilfe-DE","Help-NL","grund"],"not_rendered":{"charts":0,"images":34,"macros":1,"external_links":0,"defined_names":10,"comments":0,"pivot_tables":0},"unopened":[],"bounds":{"document_bytes":16777216,"sheet_cells":100000,"rows_first":2000,"rows_last":500,"rows_between":2000,"halvings":0,"cell_chars":16384,"cell_head_chars":4096},"cells_cut":0,"cells_raw":0,"read":"whole","date_system":"1900"}

{"sheet":"macro","index":0,"n_rows":20,"n_cols":2,"rows_kept":20,"cut":false,"hidden":true,"merged":[]}
[]
[null,"DOM-XL"]
[null,"Eine Excelanwendung zum Erfassen von Schließplänen"]
[null,"Programme Excel pour la saisie d’organigrammes "]
[null,"Excel application - master key systems"]
[]
[null,"Diese Excelanwendung muß mit \"Makros aktivieren\" geöffnet werden."]
[null,"Ab Excel 2000 müssen Sie zuerst unter EXTRAS>Macro>Sicherheit die Sicherheitsstufe auf \"Mittel\" einstellen"]
[]
[null,"Ce programme doit être ouvert avec la fonction \" activer les macros \" "]
[null,"Avec Excel 2000 vous devez définir dans le menu Outils> Macros>Sécurité  le niveau de sécurité \" moyen \"."]
[]
[null,"Open this file with active macros."]
[null,"In Excel 2000  you must change  the safety stage in Extras>Macro>Security to \"Middel\" ."]
[]
[null,"Infos:"]
[null,"DOM-Sicherheitstechnik"]
[null,"Wesselinger Str.10-16"]
[null,"50321 Brühl"]
[null,"02232-704-0"]

{"sheet":"Import","index":1,"n_rows":2,"n_cols":9,"rows_kept":2,"cut":false,"hidden":true,"merged":[]}
["Deur-Ruimteomschrijving","Sleutelnummer","Vrije invoer","Aantal Cilinder","Aantal Sleutel","Cilindertype","Lengte (A / B)","Import vanaf positie",1]
["test"]

{"sheet":"netto","index":2,"n_rows":3555,"n_cols":4,"rows_kept":3555,"cut":false,"hidden":true,"merged":[]}
["Netto Gruppen","Netto ES"]
["B","B"]
[]
[]
[]
[]
[]
[]
[]
["Netto Typ","Netto Ausführung","Netto Länge","Netto Farbe"]
["B","B","B","B"]
["B","B","B","B"]
["B","B","B","B"]
["B","B","B","B"]
["B","B","B","B"]
["B","B","B","B"]
["B","B","B","B"]
["B","B","B","B"]
["B","B","B","B"]
["B","B","B","B"]
["B","B","B","B"]
["B","B","B","B"]
["B","B","B","B"]
["B","B","B","B"]
["B","B","B","B"]
["B","B","B","B"]
["B","B","B","B"]
["B","B","B","B"]
["B","B","B","B"]
[0,0,0,0]
[0,0,0,0]
["B","B","B","B"]
[0,"B",0,0]
[0,0,0,0]
[0,0,0,0]
[0,0,0,0]
[0,"B",0,0]
[0,0,0,0]
[0,0,0,0]
[0,0,0,0]
[0,0,0,0]
[0,0,0,0]
[0,0,0,0]
[0,0,0,0]
[0,0,0,0]
[0,0,0,0]
[0,0,0,0]
[0,0,0,0]
[0,0,0,0]
[0,0,0,0]
[0,0,0,0]
[0,0,0,0]
["B","B","B","B"]
["B","B","B","B"]
["B","B","B","B"]
["B","B","B","B"]
["B","B","B","B"]
["B","B","B","B"]
["B","B","B","B"]
["B","B","B","B"]
["B","B","B","B"]
["B","B","B","B"]
["B","B","B","B"]
["B","B","B","B"]
["B","B","B","B"]
["B","B","B","B"]
["B","B","B"]
["B","B","B","B"]
["B","B","B","B"]
["B","B","B","B"]
["B","B","B","B"]
["B","B","B","B"]
["B","B","B","B"]
["B","B","B","B"]
["B","B","B","B"]
["B","B","B","B"]
["B","B","B","B"]
["B","B","B","B"]
["B","B","B","B"]
["B","B","B","B"]
["B","B","B","B"]
["B","B","B","B"]
["B","B","B","B"]
["B","B","B","B"]
["B","B","B","B"]
["B","B","B"]
["B","B","B","B"]
["B","B","B","B"]
["B","B","B","B"]
["B","B","B","B"]
["B","B","B","B"]
["B","B","B","B"]
["B","B","B","B"]
["B","B","B","B"]
["B",null,"B"]
["B",null,"B"]
["B",null,"B"]
["B",null,"B"]
["B",null,"B"]
["B",null,"B"]
["B",null,"B"]
["B",null,"B"]
["B",null,"B"]
["B",null,"B"]
["B",null,"B"]
["B",null,"B"]
["B",null,"B"]
["B",null,"B"]
["B",null,"B"]
["B",null,"B"]
["B",null,"B"]
["B",null,"B"]
["B",null,"B"]
["B",null,"B"]
["B",null,"B"]
["B",null,"B"]
["B",null,"B"]
["B",null,"B"]
["B",null,"B"]
["B",null,"B"]
["B",null,"B"]
["B",null,"B"]
["B",null,"B"]
["B",null,"B"]
["B",null,"B"]
["B",null,"B"]
["B",null,"B"]
["B",null,"B"]
["B",null,"B"]
["B",null,"B"]
["B",null,"B"]
["B",null,"B"]
["B",null,"B"]
["B",null,"B"]
["B",null,"B"]
["B",null,"B"]
["B",null,"B"]
["B",null,"B"]
["B",null,"B"]
["B",null,"B"]
["B",null,"B"]
["B",null,"B"]
["B",null,"B"]
["B",null,"B"]
["B",null,"B"]
["B",null,"B"]
["B",null,"B"]
["B",null,"B"]
["B",null,"B"]
["B",null,"B"]
["B",null,"B"]
[]
[]
["B","B","B"]
["B","B","B"]
["B",null,"B"]
["B",null,"B"]
["B",null,"B"]
["B",null,"B"]
["B",null,"B"]
["B",null,"B"]
["B",null,"B"]
["B",null,"B"]
["B",null,"B"]
["B",null,"B"]
["B",null,"B"]
["B",null,"B"]
["B",null,"B"]
["B",null,"B"]
["B",null,"B"]
["B",null,"B"]
["B",null,"B"]
["B",null,"B"]
["B",null,"B"]
["B",null,"B"]
["B",null,"B"]
["B",null,"B"]
["B",null,"B"]
["B",null,"B"]
["B",null,"B"]
["B",null,"B"]
["B",null,"B"]
["B",null,"B"]
["B",null,"B"]
["B",null,"B"]
["B",null,"B"]
["B",null,"B"]
["B",null,"B"]
["B",null,"B"]
["B",null,"B"]
["B",null,"B"]
["B",null,"B"]
["B",null,"B"]
["B",null,"B"]
["B",null,"B"]
["B",null,"B"]
["B",null,"B"]
["B",null,"B"]
["B",null,"B"]
["B",null,"B"]
["B",null,"B"]
["B",null,"B"]
["B",null,"B"]
["B",null,"B"]
["B",null,"B"]
["B",null,"B"]
["B",null,"B"]
["B",null,"B"]
["B","B","B"]
["B",null,"B"]
["B",null,"B"]
["B",null,"B"]
["B",null,"B"]
["B",null,"B"]
["B",null,"B"]
["B",null,"B"]
["B",null,"B"]
["B",null,"B"]
["B",null,"B"]
["B",null,"B"]
["B",null,"B"]
["B",null,"B"]
["B",null,"B"]
["B",null,"B"]
["B",null,"B"]
["B",null,"B"]
["B",null,"B"]
["B",null,"B"]
["B",null,"B"]
["B",null,"B"]
["B",null,"B"]
["B",null,"B"]
["B",null,"B"]
["B",null,"B"]
["B",null,"B"]
["B",null,"B"]
["B",null,"B"]
["B",null,"B"]
["B","B","B","B"]
["B","B","B","B"]
["B","B","B","B"]
["B","B","B","B"]
["B","B","B","B"]
["B",null,"B"]
["B",null,"B"]
["B",null,"B"]
["B",null,"B"]
["B","B","B","B"]
["B","B","B","B"]
["B","B","B","B"]
["B","B","B","B"]
["B",null,"B"]
["B","B","B","B"]
["B",null,"B"]
["B","B","B","B"]
["B",null,"B"]
["B",null,"B"]
["B",null,"B"]
["B",null,"B"]
["B",null,"B"]
["B",null,"B"]
["B",null,"B"]
["B",null,"B"]
["B",null,"B"]
["B",null,"B"]
["B",null,"B"]
["B",null,"B"]
["B",null,"B"]
["B",null,"B"]
["B",null,"B"]
["B",null,"B"]
["B",null,"B"]
["B",null,"B"]
["B",null,"B"]
["B",null,"B"]
["B",null,"B"]
["B",null,"B"]
["B",null,"B"]
["B",null,"B"]
["B",null,"B"]
["B",null,"B"]
["B",null,"B"]
["B",null,"B"]
["B",null,"B"]
["B",null,"B"]
["B",null,"B"]
["B",null,"B"]
["B",null,"B"]
["B",null,"B"]
["B",null,"B"]
["B",null,"B"]
["B",null,"B"]
["B",null,"B"]
["B",null,"B"]
[]
[]
[]
[]
[]
[]
[]
[]
[]
[]
[]
[]
[]
[]
[]
[]
[]
[]
[]
[]
[]
[]
[]
[]
[]
[]
[]
[]
[]
[]
[]
[]
[]
[]
[]
[]
[]
[]
[]
[]
[]
[]
[]
[]
[]
[]
[]
[]
[]
[]
[]
[]
[]
[]
[]
[]
[]
[]
[]
[]
[]
[]
[]
[]
[]
[]
[]
[]
[]
[]
[]
[]
[]
[]
[]
[]
[]
[]
[]
[]
[]
[]
[]
[]
[]
[]
[]
[]
[]
[]
[]
[]
[]
[]
[]
[]
[]
[]
[]
[]
["B",null,"B"]
["B",null,"B"]
["B",null,"B"]
["B",null,"B"]
["B",null,"B"]
["B",null,"B"]
["B",null,"B"]
["B",null,"B"]
["B",null,"B"]
["B",null,"B"]
["B",null,"B"]
["B",null,"B"]
[]
[]
[]
[]
[]
[]
[]
[]
[]
[]
[]
[]
[]
[]
[]
[]
[]
[]
[]
[]
[]
[]
[]
[]
[]
[]
[]
[]
[]
[]
[]
[]
[]
[]
[]
[]
[]
[]
[]
[]
[]
[]
[]
[]
[]
[]
[]
[]
[]
[]
[]
[]
[]
[]
[]
[]
[]
[]
[]
[]
[]
[]
[]
[]
[]
[]
[]
[]
[]
[]
[]
[]
[]
[]
[]
[]
[]
[]
[]
[]
[]
[]
[]
[]
[]
[]
[]
[]
[]
[]
[]
[]
[]
[]
[]
[]
[]
[]
[]
[]
[]
[]
[]
[]
[]
[]
[]
[]
[]
[]
[]
[]
[]
[]
[]
[]
[]
[]
[]
[]
[]
[]
[]
[]
[]
[]
[]
[]
[]
[]
[]
[]
[]
[]
[]
[]
[]
[]
[]
[]
[]
[]
[]
[]
[]
[]
[]
[]
[]
[]
[]
[]
[]
[]
[]
[]
[]
[]
[]
[]
[]
[]
[]
[]
[]
[]
[]
[]
[]
[]
[]
[]
[]
[]
[]
[]
[]
[]
[]
[]
[]
[]
[]
[]
[]
[]
[]
[]
[]
[]
[]
[]
[]
[]
[]
[]
[]
[]
[]
[]
[]
[]
[]
[]
[]
[]
[]
[]
[]
[]
[]
[]
[]
[]
[]
[]
[]
[]
[]
[]
[]
[]
[]
[]
[]
[]
[]
[]
[]
[]
[]
[]
[]
[]
[]
[]
[]
[]
[]
[]
[]
[]
[]
[]
[]
[]
[]
[]
[]
[]
[]
[]
[]
[]
[]
[]
[]
[]
[]
[]
[]
[]
[]
[]
[]
[]
[]
[]
[]
[]
[]
[]
[]
[]
[]
[]
[]
[]
[]
[]
[]
[]
[]
[]
[]
[]
[]
[]
[]
[]
[]
[]
[]
[]
[]
[]
[]
[]
[]
[]
[]
[]
[]
[]
[]
[]
[]
[]
[]
[]
[]
[]
[]
[]
[]
[]
[]
[]
[]
[]
[]
[]
[]
[]
[]
[]
[]
[]
[]
[]
[]
[]
[]
[]
[]
[]
[]
[]
[]
[]
[]
[]
[]
[]
[]
[]
[]
[]
[]
[]
[]
[]
[]
[]
[]
[]
[]
[]
[]
[]
[]
[]
[]
[]
[]
[]
[]
[]
[]
[]
[]
[]
[]
[]
[]
[]
[]
[]
[]
[]
[]
[]
[]
[]
[]
[]
[]
[]
[]
[]
[]
[]
[]
[]
[]
[]
[]
[]
[]
[]
[]
[]
[]
[]
[]
[]
[]
[]
[]
[]
[]
[]
[]
[]
[]
[]
[]
[]
[]
[]
[]
[]
[]
[]
[]
[]
[]
[]
[]
[]
[]
[]
[]
[]
[]
[]
[]
[]
[]
[]
[]
[]
[]
[]
[]
[]
[]
[]
[]
[]
[]
[]
[]
[]
[]
[]
[]
[]
[]
[]
[]
[]
[]
[]
[]
[]
[]
[]
[]
[]
[]
[]
[]
[]
[]
[]
[]
[]
[]
[]
[]
[]
[]
[]
[]
[]
[]
[]
[]
[]
[]
[]
[]
[]
[]
[]
[]
[]
[]
[]
[]
[]
[]
[]
[]
[]
[]
[]
[]
[]
[]
[]
[]
[]
[]
[]
[]
[]
[]
[]
[]
[]
[]
[]
[]
[]
[]
[]
[]
[]
[]
[]
[]
[]
[]
[]
[]
[]
[]
[]
[]
[]
[]
[]
[]
[]
[]
[]
[]
[]
[]
[]
[]
[]
[]
[]
[]
[]
[]
[]
[]
[]
[]
[]
[]
[]
[]
[]
[]
[]
[]
[]
[]
[]
[]
[]
[]
[]
[]
[]
[]
[]
[]
[]
[]
[]
[]
[]
[]
[]
[]
[]
[]
[]
[]
[]
[]
[]
[]
[]
[]
[]
[]
[]
[]
[]
[]
[]
[]
[]
[]
[]
[]
[]
[]
[]
[]
[]
[]
[]
[]
[]
[]
[]
[]
[]
[]
[]
[]
[]
[]
[]
[]
[]
[]
[]
[]
[]
[]
[]
[]
[]
[]
[]
[]
[]
[]
[]
[]
[]
[]
[]
[]
[]
[]
[]
[]
[]
[]
[]
[]
[]
[]
[]
[]
[]
[]
[]
[]
[]
[]
[]
[]
[]
[]
[]
[]
[]
[]
[]
[]
[]
[]
[]
[]
[]
[]
[]
[]
[]
[]
[]
[]
[]
[]
[]
[]
[]
[]
[]
[]
[]
[]
[]
[]
[]
[]
[]
[]
[]
[]
[]
[]
[]
[]
[]
[]
[]
[]
[]
[]
[]
[]
[]
[]
[]
[]
[]
[]
[]
[]
[]
[]
[]
[]
[]
[]
[]
[]
[]
[]
[]
[]
[]
[]
[]
[]
[]
[]
[]
[]
[]
[]
[]
[]
[]
[]
[]
[]
[]
[]
[]
[]
[]
[]
[]
[]
[]
[]
[]
[]
[]
[]
[]
[]
[]
[]
[]
[]
[]
[]
[]
[]
[]
[]
[]
[]
[]
[]
[]
[]
[]
[]
[]
[]
[]
[]
[]
[]
[]
[]
[]
[]
[]
[]
[]
[]
[]
[]
[]
[]
[]
[]
[]
[]
[]
[]
[]
[]
[]
[]
[]
[]
[]
[]
[]
[]
[]
[]
[]
[]
[]
[]
[]
[]
[]
[]
[]
[]
[]
[]
[]
[]
[]
[]
[]
[]
[]
[]
[]
[]
[]
[]
[]
[]
[]
[]
[]
[]
[]
[]
[]
[]
[]
[]
[]
[]
[]
[]
[]
[]
[]
[]
[]
[]
[]
[]
[]
[]
[]
[]
[]
[]
[]
[]
[]
[]
[]
[]
[]
[]
[]
[]
[]
[]
[]
[]
[]
[]
[]
[]
[]
[]
[]
[]
[]
[]
[]
[]
[]
[]
[]
[]
[]
[]
[]
[]
[]
[]
[]
[]
[]
[]
[]
[]
[]
[]
[]
[]
[]
[]
[]
[]
[]
[]
[]
[]
[]
[]
[]
[]
[]
[]
[]
[]
[]
[]
[]
[]
[]
[]
[]
[]
[]
[]
[]
[]
[]
[]
[]
[]
[]
[]
[]
[]
[]
[]
[]
[]
[]
[]
[]
[]
[]
[]
[]
[]
[]
[]
[]
[]
[]
[]
[]
[]
[]
[]
[]
[]
[]
[]
[]
[]
[]
[]
[]
[]
[]
[]
[]
[]
[]
[]
[]
[]
[]
[]
[]
[]
[]
[]
[]
[]
[]
[]
[]
[]
[]
[]
[]
[]
[]
[]
[]
[]
[]
[]
[]
[]
[]
[]
[]
[]
[]
[]
[]
[]
[]
[]
[]
[]
[]
[]
[]
[]
[]
[]
[]
[]
[]
[]
[]
[]
[]
[]
[]
[]
[]
[]
[]
[]
[]
[]
[]
[]
[]
[]
[]
[]
[]
[]
[]
[]
[]
[]
[]
[]
[]
[]
[]
[]
[]
[]
[]
[]
[]
[]
[]
[]
[]
[]
[]
[]
[]
[]
[]
[]
[]
[]
[]
[]
[]
[]
[]
[]
[]
[]
[]
[]
[]
[]
[]
[]
[]
[]
[]
[]
[]
[]
[]
[]
[]
[]
[]
[]
[]
[]
[]
[]
[]
[]
[]
[]
[]
[]
[]
[]
[]
[]
[]
[]
[]
[]
[]
[]
[]
[]
[]
[]
[]
[]
[]
[]
[]
[]
[]
[]
[]
[]
[]
[]
[]
[]
[]
[]
[]
[]
[]
[]
[]
[]
[]
[]
[]
[]
[]
[]
[]
[]
[]
[]
[]
[]
[]
[]
[]
[]
[]
[]
[]
[]
[]
[]
[]
[]
[]
[]
[]
[]
[]
[]
[]
[]
[]
[]
[]
[]
[]
[]
[]
[]
[]
[]
[]
[]
[]
[]
[]
[]
[]
[]
[]
[]
[]
[]
[]
[]
[]
[]
[]
[]
[]
[]
[]
[]
[]
[]
[]
[]
[]
[]
[]
[]
[]
[]
[]
[]
[]
[]
[]
[]
[]
[]
[]
[]
[]
[]
[]
[]
[]
[]
[]
[]
[]
[]
[]
[]
[]
[]
[]
[]
[]
[]
[]
[]
[]
[]
[]
[]
[]
[]
[]
[]
[]
[]
[]
[]
[]
[]
[]
[]
[]
[]
[]
[]
[]
[]
[]
[]
[]
[]
[]
[]
[]
[]
[]
[]
[]
[]
[]
[]
[]
[]
[]
[]
[]
[]
[]
[]
[]
[]
[]
[]
[]
[]
[]
[]
[]
[]
[]
[]
[]
[]
[]
[]
[]
[]
[]
[]
[]
[]
[]
[]
[]
[]
[]
[]
[]
[]
[]
[]
[]
[]
[]
[]
[]
[]
[]
[]
[]
[]
[]
[]
[]
[]
[]
[]
[]
[]
[]
[]
[]
[]
[]
[]
[]
[]
[]
[]
[]
[]
[]
[]
[]
[]
[]
[]
[]
[]
[]
[]
[]
[]
[]
[]
[]
[]
[]
[]
[]
[]
[]
[]
[]
[]
[]
[]
[]
[]
[]
[]
[]
[]
[]
[]
[]
[]
[]
[]
[]
[]
[]
[]
[]
[]
[]
[]
[]
[]
[]
[]
[]
[]
[]
[]
[]
[]
[]
[]
[]
[]
[]
[]
[]
[]
[]
[]
[]
[]
[]
[]
[]
[]
[]
[]
[]
[]
[]
[]
[]
[]
[]
[]
[]
[]
[]
[]
[]
[]
[]
[]
[]
[]
[]
[]
[]
[]
[]
[]
[]
[]
[]
[]
[]
[]
[]
[]
[]
[]
[]
[]
[]
[]
[]
[]
[]
[]
[]
[]
[]
[]
[]
[]
[]
[]
[]
[]
[]
[]
[]
[]
[]
[]
[]
[]
[]
[]
[]
[]
[]
[]
[]
[]
[]
[]
[]
[]
[]
[]
[]
[]
[]
[]
[]
[]
[]
[]
[]
[]
[]
[]
[]
[]
[]
[]
[]
[]
[]
[]
[]
[]
[]
[]
[]
[]
[]
[]
[]
[]
[]
[]
[]
[]
[]
[]
[]
[]
[]
[]
[]
[]
[]
[]
[]
[]
[]
[]
[]
[]
[]
[]
[]
[]
[]
[]
[]
[]
[]
[]
[]
[]
[]
[]
[]
[]
[]
[]
[]
[]
[]
[]
[]
[]
[]
[]
[]
[]
[]
[]
[]
[]
[]
[]
[]
[]
[]
[]
[]
[]
[]
[]
[]
[]
[]
[]
[]
[]
[]
[]
[]
[]
[]
[]
[]
[]
[]
[]
[]
[]
[]
[]
[]
[]
[]
[]
[]
[]
[]
[]
[]
[]
[]
[]
[]
[]
[]
[]
[]
[]
[]
[]
[]
[]
[]
[]
[]
[]
[]
[]
[]
[]
[]
[]
[]
[]
[]
[]
[]
[]
[]
[]
[]
[]
[]
[]
[]
[]
[]
[]
[]
[]
[]
[]
[]
[]
[]
[]
[]
[]
[]
[]
[]
[]
[]
[]
[]
[]
[]
[]
[]
[]
[]
[]
[]
[]
[]
[]
[]
[]
[]
[]
[]
[]
[]
[]
[]
[]
[]
[]
[]
[]
[]
[]
[]
[]
[]
[]
[]
[]
[]
[]
[]
[]
[]
[]
[]
[]
[]
[]
[]
[]
[]
[]
[]
[]
[]
[]
[]
[]
[]
[]
[]
[]
[]
[]
[]
[]
[]
[]
[]
[]
[]
[]
[]
[]
[]
[]
[]
[]
[]
[]
[]
[]
[]
[]
[]
[]
[]
[]
[]
[]
[]
[]
[]
[]
[]
[]
[]
[]
[]
[]
[]
[]
[]
[]
[]
[]
[]
[]
[]
[]
[]
[]
[]
[]
[]
[]
[]
[]
[]
[]
[]
[]
[]
[]
[]
[]
[]
[]
[]
[]
[]
[]
[]
[]
[]
[]
[]
[]
[]
[]
[]
[]
[]
[]
[]
[]
[]
[]
[]
[]
[]
[]
[]
[]
[]
[]
[]
[]
[]
[]
[]
[]
[]
[]
[]
[]
[]
[]
[]
[]
[]
[]
[]
[]
[]
[]
[]
[]
[]
[]
[]
[]
[]
[]
[]
[]
[]
[]
[]
[]
[]
[]
[]
[]
[]
[]
[]
[]
[]
[]
[]
[]
[]
[]
[]
[]
[]
[]
[]
[]
[]
[]
[]
[]
[]
[]
[]
[]
[]
[]
[]
[]
[]
[]
[]
[]
[]
[]
[]
[]
[]
[]
[]
[]
[]
[]
[]
[]
[]
[]
[]
[]
[]
[]
[]
[]
[]
[]
[]
[]
[]
[]
[]
[]
[]
[]
[]
[]
[]
[]
[]
[]
[]
[]
[]
[]
[]
[]
[]
[]
[]
[]
[]
[]
[]
[]
[]
[]
[]
[]
[]
[]
[]
[]
[]
[]
[]
[]
[]
[]
[]
[]
[]
[]
[]
[]
[]
[]
[]
[]
[]
[]
[]
[]
[]
[]
[]
[]
[]
[]
[]
[]
[]
[]
[]
[]
[]
[]
[]
[]
[]
[]
[]
[]
[]
[]
[]
[]
[]
[]
[]
[]
[]
[]
[]
[]
[]
[]
[]
[]
[]
[]
[]
[]
[]
[]
[]
[]
[]
[]
[]
[]
[]
[]
[]
[]
[]
[]
[]
[]
[]
[]
[]
[]
[]
[]
[]
[]
[]
[]
[]
[]
[]
[]
[]
[]
[]
[]
[]
[]
[]
[]
[]
[]
[]
[]
[]
[]
[]
[]
[]
[]
[]
[]
[]
[]
[]
[]
[]
[]
[]
[]
[]
[]
[]
[]
[]
[]
[]
[]
[]
[]
[]
[]
[]
[]
[]
[]
[]
[]
[]
[]
[]
[]
[]
[]
[]
[]
[]
[]
[]
[]
[]
[]
[]
[]
[]
[]
[]
[]
[]
[]
[]
[]
[]
[]
[]
[]
[]
[]
[]
[]
[]
[]
[]
[]
[]
[]
[]
[]
[]
[]
[]
[]
[]
[]
[]
[]
[]
[]
[]
[]
[]
[]
[]
[]
[]
[]
[]
[]
[]
[]
[]
[]
[]
[]
[]
[]
[]
[]
[]
[]
[]
[]
[]
[]
[]
[]
[]
[]
[]
[]
[]
[]
[]
[]
[]
[]
[]
[]
[]
[]
[]
[]
[]
[]
[]
[]
[]
[]
[]
[]
[]
[]
[]
[]
[]
[]
[]
[]
[]
[]
[]
[]
[]
[]
[]
[]
[]
[]
[]
[]
[]
[]
[]
[]
[]
[]
[]
[]
[]
[]
[]
[]
[]
[]
[]
[]
[]
[]
[]
[]
[]
[]
[]
[]
[]
[]
[]
[]
[]
[]
[]
[]
[]
[]
[]
[]
[]
[]
[]
[]
[]
[]
[]
[]
[]
[]
[]
[]
[]
[]
[]
[]
[]
[]
[]
[]
[]
[]
[]
[]
[]
[]
[]
[]
[]
[]
[]
[]
[]
[]
[]
[]
[]
[]
[]
[]
[]
[]
[]
[]
[]
[]
[]
[]
[]
[]
[]
[]
[]
[]
[]
[]
[]
[]
[]
[]
[]
[]
[]
[]
[]
[]
[]
[]
[]
[]
[]
[]
[]
[]
[]
[]
[]
[]
[]
[]
[]
[]
[]
[]
[]
[]
[]
[]
[]
[]
[]
[]
[]
[]
[]
[]
[]
[]
[]
[]
[]
[]
[]
[]
[]
[]
[]
[]
[]
[]
[]
[]
[]
["B","B","B","B"]
[]
[]
[]
["B","B","B","B"]
[]
[]
[]
[]
[]
[]
[]
[]
[]
[]
[]
[]
[]
[]
[]
[]
[]
[]
[]
[]
[]
[]
[]
[]
[]
[]
[]
[]
[]
[]
[]
[]
[]
[]
[]
[]
[]
[]
[]
[]
[]
[]
[]
[]
[]
[]
[]
[]
[]
[]
[]
[]
[]
[]
[]
[]
[]
[]
[]
[]
[]
[]
[]
[]
[]
[]
[]
[]
[]
[]
[]
[]
[]
[]
[]
[]
[]
[]
[]
[]
[]
[]
[]
[]
[]
[]
[]
[]
[]
[]
[]
[]
[]
[]
[]
[]
[]
[]
[]
[]
[]
[]
[]
[]
[]
[]
[]
[]
[]
[]
[]
[]
[]
[]
[]
[]
[]
[]
[]
[]
[]
[]
[]
[]
[]
[]
[]
[]
[]
[]
[]
[]
[]
[]
[]
[]
[]
[]
[]
[]
[]
[]
[]
[]
[]
[]
[]
[]
[]
[]
[]
[]
[]
[]
[]
[]
[]
[]
[]
[]
[]
[]
[]
[]
[]
[]
[]
[]
[]
[]
[]
[]
[]
[]
[]
[]
[]
[]
[]
[]
[]
[]
[]
[]
[]
[]
[]
[]
[]
[]
[]
[]
[]
[]
[]
[]
[]
[]
[]
[]
[]
[]
[]
[]
[]
[]
[]
[]
[]
[]
[]
[]
[]
[]
[]
[]
[]
[]
[]
[]
[]
[]
[]
[]
[]
[]
[]
[]
[]
[]
[]
[]
[]
[]
[]
[]
[]
[]
[]
[]
[]
[]
[]
[]
[]
[]
[]
[]
[]
[]
[]
[]
[]
[]
[]
[]
[]
[]
[]
[]
[]
[]
[]
[]
[]
[]
[]
[]
[]
[]
[]
[]
[]
[]
[]
[]
[]
[]
[]
[]
[]
[]
[]
[]
[]
[]
[]
[]
[]
[]
[]
[]
[]
[]
[]
[]
[]
[]
[]
[]
[]
[]
[]
[]
[]
[]
[]
[]
[]
[]
[]
[]
[]
[]
[]
[]
[]
[]
[]
[]
[]
[]
[]
[]
[]
[]
[]
[]
[]
[]
[]
[]
[]
[]
[]
[]
[]
[]
[]
[]
[]
[]
[]
[]
[]
[]
[]
[]
[]
[]
[]
[]
[]
[]
[]
[]
[]
[]
[]
[]
[]
[]
[]
[]
[]
[]
[]
[]
[]
[]
[]
[]
[]
[]
[]
[]
[]
[]
[]
[]
[]
[]
[]
[]
[]
[]
[]
[]
[]
[]
[]
[]
[]
[]
[]
[]
[]
[]
[]
[]
[]
[]
[]
[]
[]
[]
[]
[]
[]
[]
[]
[]
[]
[]
[]
[]
[]
[]
[]
[]
[]
[]
[]
[]
[]
[]
[]
[]
[]
["B","B","B","B"]
[]
[]
[]
[]
[]
[]
[]
[]
[]
[]
[]
[]
[]
[]
[]
[]
[]
[]
[]
[]
[]
[]
[]
[]
[]
[]
[]
[]
[]
[]
[]
[]
[]
[]
[]
[]
[]
[]
[]
[]
[]
[]
[]
[]
[]
[]
[]
[]
[]
[]
[]
[]
[]
[]
[]
[]
[]
[]
[]
[]
[]
[]
[]
[]
[]
[]
[]
[]
[]
[]
[]
[]
[]
[]
[]
[]
[]
[]
[]
[]
[]
[]
[]
[]
[]
[]
[]
[]
[]
[]
[]
[]
[]
[]
[]
[]
[]
[]
[]
[]
[]
[]
[]
[]
[]
[]
[]
[]
[]
[]
[]
[]
[]
[]
[]
[]
[]
[]
[]
[]
[]
[]
[]
[]
[]
[]
[]
[]
[]
[]
[]
[]
[]
[]
[]
[]
[]
[]
[]
[]
[]
[]
[]
[]
[]
[]
[]
[]
[]
[]
[]
[]
[]
[]
[]
[]
[]
[]
[]
[]
[]
[]
[]
[]
[]
[]
[]
[]
[]
[]
[]
[]
[]
[]
[]
[]
[]
[]
[]
[]
[]
[]
[]
[]
[]
[]
[]
[]
[]
[]
[]
[]
[]
[]
[]
[]
[]
[]
[]
[]
[]
[]
[]
[]
[]
[]
[]
[]
[]
[]
[]
[]
[]
[]
[]
[]
[]
[]
[]
[]
[]
[]
[]
[]
[]
[]
[]
[]
[]
[]
[]
[]
[]
[]
[]
[]
[]
[]
[]
[]
[]
[]
[]
[]
[]
[]
[]
[]
[]
[]
[]
[]
[]
[]
[]
[]
[]
[]
[]
[]
[]
[]
[]
[]
[]
[]
[]
[]
[]
[]
[]
[]
[]
[]
[]
[]
[]
[]
[]
[]
[]
[]
[]
[]
[]
[]
[]
[]
[]
[]
[]
[]
[]
[]
[]
[]
[]
[]
[]
[]
[]
[]
[]
[]
[]
[]
[]
[]
[]
[]
[]
[]
[]
[]
[]
[]
["B","B","B","B"]
["B","B","B","B"]
["B",null,"B"]
["B",null,"B"]
["B",null,"B"]
["B","B","B"]

{"sheet":"diverses","index":3,"n_rows":4,"n_cols":2,"rows_kept":4,"cut":false,"hidden":true,"merged":[]}
["Schlüsselnummer","Anzahl"]
["12",{"$f":"COUNTIF('S-Plan'!E:E,A2)","v":0}]
["Bestehende vorhanden Status X","Anzahl"]
["X",{"$f":"COUNTIF('S-Plan'!B:B,A4)","v":0}]

{"sheet":"altanl","index":4,"n_rows":22,"n_cols":4,"rows_kept":22,"cut":false,"hidden":true,"merged":[]}
["VON","BIS","Aufschlag","Länge"]
[null,null,0,0]
["FVTZ","FWWW",15,4]
["NFCN","NFKY",15,4]
["NHWO","NWWW",15,4]
["REZO","RWWW",15,4]
["YAAA","YZZZ",15,4]
["XAAA","XGYD",15,4]
["179289","347661",15,7]
["179289","347661",15,8]
["AA","BB",15,2]
["AAA","ZZZ",15,3]
["AA11","CM96",15,4]
["AAAA","FVTY",15,4]
["LAAA","MWWW",15,4]
["NAAA","NFCM",15,4]
["NHAV","NHWN",15,4]
["PAAA","RFAV",15,4]
["800000",806000,15,6]
["100000","179288",15,7]
["337063",999999,0,7]
["337063",999999,0,8]

{"sheet":"SchAuf","index":5,"n_rows":16,"n_cols":11,"rows_kept":16,"cut":false,"hidden":true,"merged":[]}
["System","Frei pro Zyl","Aufpreis","Gruppen HS","GHS","Gefahr","ES ohne zyl","HS-GS ohne zyl","GHS ohne zyl","G ohne zyl","Netto"]
["DIAMANT",0,16.91,23.56,53.76,null,35.869999999999997,46.84,53.76,null,"B"]
["IX GAMMA",3,11.67,17.3,23.1,null,27.17,35.9,43.11,null,"B"]
["IX10KG",3,11.67,17.3,23.1,null,27.17,35.9,43.11,null,"B"]
["IX5HT",3,11.67,17.3,23.1,null,27.17,35.9,43.11,null,"B"]
["IX6KG",3,11.67,17.3,23.1,null,27.17,35.9,43.11,null,"B"]
["IX6SR",3,11.67,17.3,23.1,null,27.17,35.9,43.11,null,"B"]
["IXHT",3,11.67,17.3,23.1,null,27.17,35.9,43.11,null,"B"]
["IXSAT",3,11.67,17.3,23.1,null,27.17,35.9,43.11,null,"B"]
["RS SIGMA",3,9.48,15.22,21.26,null,17.77,25.94,30.85,null,"B"]
["RS5",3,9.48,15.22,21.26,null,17.77,25.94,30.85,null,"B"]
["RS8",3,9.48,15.22,21.26,null,17.77,25.94,30.85,null,"B"]
["IXTWINSTAR",3,11.67,17.3,23.1,null,27.17,35.9,43.11,null,"B"]
["IXTWIDO",3,11.67,17.3,23.1,null,27.17,35.9,43.11,null,"B"]
["IXTECO",3,11.67,17.3,23.1,null,27.17,35.9,43.11,null,"B"]
["IXTWINSTAR-C",3,11.67,17.3,23.1,null,27.17,35.9,43.11,null,"B"]

{"sheet":"preis","index":6,"n_rows":0,"n_cols":0,"rows_kept":0,"cut":false,"hidden":true,"merged":[]}

{"sheet":"Start","index":7,"n_rows":30,"n_cols":10,"rows_kept":30,"cut":false,"hidden":false,"merged":[[0,5,0,9],[27,2,27,6],[27,7,27,8],[15,2,15,9],[14,2,14,9],[10,2,11,3],[2,2,4,3]]}
[null,null,"DOM-XL 2020 V5.3.1"]
[]
[]
[]
[]
[]
[]
[]
[]
[]
[]
[]
[]
[]
[]
[]
[]
[null,null,"Klant",null,null,"Project",null,null,"Afwijkend leveradres"]
[null,null,"Klantnummer","617441",null,"Versienummer",null,null,"Naam 1"]
[null,null,"Telefoon",null,null,"Postcode",null,null,"Naam 2"]
[null,null,"Contactpersoon",null,null,"Woonplaats",null,null,"Straat"]
[null,null,"Straat",null,null,"Provincie"]
[null,null,"Postcode",null,null,null,null,null,"Postcode",""]
[null,null,"Woonplaats",null,null,"Referentie",null,null,"Woonplaats",""]
[null,null,"Provincie",null,null,null,null,null,"Provincie"]
[]
[null,null,"Bijzonderheden 2"]
[]
[]
[null,null,null,null,null,null,null,null,null,"we domore for security"]

{"sheet":"Ausf","index":8,"n_rows":150,"n_cols":18,"rows_kept":150,"cut":false,"hidden":true,"merged":[]}
["ID","Kurzzeichen","Beschreibung","Tabelle","Aufpreis","Merkmal1","Wert1","Merkmal2","Wert2","Merkmal3","Wert3","Merkmal4","Wert4","Merkmal5","Wert5","Netto","Tabelle","Beschreibung"]
[1,"K1","Knauf",null,0,"B_KNAUFAUSF","KNK1",null,null,null,null,null,null,null,null,"B",1,"Ohne G Fuktion Doppelzyl"]
[1,"K2","Knauf",null,0,"B_KNAUFAUSF","KNK2",null,null,null,null,null,null,null,null,"B",2,"Mit G Funktion Doppelzyl"]
[1,"K3","Knauf",null,0,"B_KNAUFAUSF","KNK3",null,null,null,null,null,null,null,null,"B",3,"K2"]
[1,"K4","Knauf",null,0,"B_KNAUFAUSF","KNK4",null,null,null,null,null,null,null,null,"B",4,382]
[1,"K6","Knauf",null,0,"B_KNAUFAUSF","KNK6",null,null,null,null,null,null,null,null,"B",6,"419/1"]
[1,"SEW","Seewasser","Ohne G Fuktion Doppelzyl",0,"B_SEEWASSERAUSF","SEW","B_STULPSCHRAUBENAUSF","SA80 SEEW","B_FAERBUNG_AUSSEN","FA004","B_FAERBUNG_INNEN","FI004",null,null,"B",7,777]
[1,"Slipkoppeling","Slipkoppeling",null,23.22]
[1,"T","Beidseitig","Ohne G Fuktion Doppelzyl",7.46,"B_FUNKTIONEN","FUT",null,null,null,null,null,null,null,null,"B",8,"Halbzyl"]
[2,"G","Gefahrenfunktion mit sep. Gefahrenschlüssel","Mit G Funktion Doppelzyl",2.9,"B_FUNKTIONEN","FUG",null,null,null,null,null,null,null,null,"B",9,"gelöscht"]
[2,"K1","Knauf",null,0,"B_KNAUFAUSF","KNK1",null,null,null,null,null,null,null,null,"B",10,3020]
[2,"K2","Knauf",null,0,"B_KNAUFAUSF","KNK2",null,null,null,null,null,null,null,null,"B",11,"333RI"]
[2,"K3","Knauf",null,0,"B_KNAUFAUSF","KNK3",null,null,null,null,null,null,null,null,"B",12,"Blindzyl"]
[2,"K4","Knauf",null,0,"B_KNAUFAUSF","KNK4",null,null,null,null,null,null,null,null,"B",13,"Ohne T und G"]
[2,"K6","Knauf",null,0,"B_KNAUFAUSF","KNK6",null,null,null,null,null,null,null,null,"B",14,"VAR"]
[2,"SEW","Seewasser","Mit G Funktion Doppelzyl",0,"B_SEEWASSERAUSF","SEW","B_STULPSCHRAUBENAUSF","SA80 SEEW","B_FAERBUNG_AUSSEN","FA004","B_FAERBUNG_INNEN","FI004",null,null,"B",15,"Cod ES fü Enet"]
[2,"Slipkoppeling","Slipkoppeling",null,23.22,null,null,null,null,null,null,null,null,null,null,null,16,555]
[2,"T","Beidseitig","Mit G Funktion Doppelzyl",7.46,"B_FUNKTIONEN","FUT",null,null,null,"FA004",null,null,null,null,"B"]
[3,"SEW","Seewasser","Ohne G Fuktion Doppelzyl",0,"B_SEEWASSERAUSF","SEW","B_STULPSCHRAUBENAUSF","SA80 SEEW","B_FAERBUNG_AUSSEN","FA004","B_FAERBUNG_INNEN","FI004",null,null,"B"]
[3,"Zorgfunctie","Zorgfunctie",null,12.02,"B_SCHLIESSFUNKTION_AU_IN","SHJA"]
[4,"LI",null,382,null,"B_AUSFUEHRUNG_LI_RE","AGLI","B_TEILENR_HEBEL_10_8_BAU","200013F013",null,null,null,null,null,null,"B"]
[4,"RE",null,382,null,"B_AUSFUEHRUNG_LI_RE","AGRE","B_TEILENR_HEBEL_10_8_BAU","200013F013",null,null,null,null,null,null,"B"]
[4,"SD-LI","Zahnrad Schlüsseldepot",382,null,"B_AUSFUEHRUNG_LI_RE","AGLI","B_TEILENR_HEBEL_10_8_BAU","200013F013","B_ZUBEHOER_SCHRANK","SD"]
[4,"SD-RE","Zahnrad Schlüsseldepot",382,null,"B_AUSFUEHRUNG_LI_RE","AGRE","B_TEILENR_HEBEL_10_8_BAU","200013F013","B_ZUBEHOER_SCHRANK","SD"]
[5,"393/1 - 1 x 90°","Schlüsseldrehweg",393,0,"B_SCHALTERAUSF","2S/FE STE",null,null,null,null,null,null,null,null,"B"]
[5,"393/2 - 1 x 90° rückfedernd","Schlüsseldrehweg",393,0,"B_SCHALTERAUSF","2S/RE STE",null,null,null,null,null,null,null,null,"B"]
[5,"393/3 - 1 x 360° 90°","Schlüsseldrehweg",393,0,"B_SCHALTERAUSF","2S/1X STE",null,null,null,null,null,null,null,null,"B"]
[5,"393/4 - 2 x 90°","Schlüsseldrehweg",393,0,"B_SCHALTERAUSF","2S/2X STE",null,null,null,null,null,null,null,null,"B"]
[6,"A","Gewinde - Mitnehmer","419/1",0,"B_MITNEHMERAUSF_419","CMA",null,null,null,null,null,null,null,null,"B"]
[6,"B","Gewinde - Mitnehmer","419/1",0,"B_MITNEHMERAUSF_419","CMB",null,null,null,null,null,null,null,null,"B"]
[6,"C","Gewinde - Mitnehmer","419/1",0,"B_MITNEHMERAUSF_419","CMC",null,null,null,null,null,null,null,null,"B"]
[6,"D","Gewinde - Mitnehmer","419/1",0,"B_MITNEHMERAUSF_419","CMD",null,null,null,null,null,null,null,null,"B"]
[6,"E","Gewinde - Mitnehmer","419/1",0,"B_MITNEHMERAUSF_419","CME",null,null,null,null,null,null,null,null,"B"]
[6,"F","Gewinde - Mitnehmer","419/1",0,"B_MITNEHMERAUSF_419","CMF",null,null,null,null,null,null,null,null,"B"]
[6,"G","Gewinde - Mitnehmer","419/1",0,"B_MITNEHMERAUSF_419","CMG",null,null,null,null,null,null,null,null,"B"]
[7,"60 mm HB","Bügelhöhe 60 mm",777,11.86,"B_BUEGEL","BULANG",null,null,null,null,null,null,null,null,"B"]
[8,"SEW","Seewasser","Ohne G Fuktion Halbzyl",0,"B_SEEWASSERAUSF","SEW","B_STULPSCHRAUBENAUSF","SA80 SEEW","B_FAERBUNG_AUSSEN","FA004",null,null,null,null,"B"]
[11,"RI10",null,"333RI",null,"B_MITNEHMERAUSF","MIRI10",null,null,null,null,null,null,null,null,"B"]
[11,"RI14",null,"333RI",null,"B_MITNEHMERAUSF","MIRI14",null,null,null,null,null,null,null,null,"B"]
[12,"52-144 mm"]
[14,"BLN","Einseitig Blind einseitig normal","VAR",0,"B_VARIOAUSF_AUSSEN","VAN","B_VARIOAUSF_INNEN","VIBL"]
[14,"BLS","Eins. Blind, Eins SS","VAR",0,"B_VARIOAUSF_AUSSEN","VAS","B_VARIOAUSF_INNEN","VIBL"]
[14,"SN","Eins SS Eins Normal","VAR",0,"B_VARIOAUSF_AUSSEN","VAS","B_VARIOAUSF_INNEN","VIN"]
[14,"SS","SS","VAR",0,"B_VARIOAUSF_AUSSEN","VAS","B_VARIOAUSF_INNEN","VIS"]
[16,"RPP",null,null,0,"B_AUSFUEHRUNG_ROHR_PLATTE","RPP"]
[16,"RPR35",null,null,0,"B_AUSFUEHRUNG_ROHR_PLATTE","RPR35"]
[16,"RPR38",null,null,0,"B_AUSFUEHRUNG_ROHR_PLATTE","RPR38"]
[16,"RPR43",null,null,0,"B_AUSFUEHRUNG_ROHR_PLATTE","RPR43"]
[16,"RPR48",null,null,0,"B_AUSFUEHRUNG_ROHR_PLATTE","RPR48"]
[16,"RPR53",null,null,0,"B_AUSFUEHRUNG_ROHR_PLATTE","RPR53"]
[16,"RPR58",null,null,0,"B_AUSFUEHRUNG_ROHR_PLATTE","RPR58"]
[16,"RPR63",null,null,0,"B_AUSFUEHRUNG_ROHR_PLATTE","RPR63"]
[16,"RPR68",null,null,0,"B_AUSFUEHRUNG_ROHR_PLATTE","RPR68"]
[16,"RPR73",null,null,0,"B_AUSFUEHRUNG_ROHR_PLATTE","RPR73"]
[16,"RPR78",null,null,0,"B_AUSFUEHRUNG_ROHR_PLATTE","RPR78"]
[16,"RPR83",null,null,0,"B_AUSFUEHRUNG_ROHR_PLATTE","RPR83"]
[17,"A       ",null,null,null,"B_MITNEHMERAUSF_419","CMA       "]
[17,"A TOYOKO",null,null,null,"B_MITNEHMERAUSF_419","CMA TOYOKO"]
[17,"B       ",null,null,null,"B_MITNEHMERAUSF_419","CMB       "]
[17,"C       ",null,null,null,"B_MITNEHMERAUSF_419","CMC       "]
[17,"D       ",null,null,null,"B_MITNEHMERAUSF_419","CMD       "]
[17,"E       ",null,null,null,"B_MITNEHMERAUSF_419","CME       "]
[17,"F       ",null,null,null,"B_MITNEHMERAUSF_419","CMF       "]
[17,"G       ",null,null,null,"B_MITNEHMERAUSF_419","CMG       "]
[17,"H       ",null,null,null,"B_MITNEHMERAUSF_419","CMH       "]
[17,"X",null,null,null,"B_MITNEHMERAUSF_419","CMX"]
[17,"Y",null,null,null,"B_MITNEHMERAUSF_419","CMY"]
[17,"Z",null,null,null,"B_MITNEHMERAUSF_419","CMZ"]
[18,"K2","Knauf",null,6.21,"B_KNAUFAUSF","KNK2"]
[18,"K3","Knauf",null,6.21,"B_KNAUFAUSF","KNK3"]
[18,"K4","Knauf",null,6.21,"B_KNAUFAUSF","KNK4"]
[18,"K6","Knauf",null,0,"B_KNAUFAUSF","KNK6"]
[19,"DM-25","DOORMAAT",null,0,"B_DORNMASS","DO25"]
[19,"DM-30","DOORMAAT",null,0,"B_DORNMASS","DO30"]
[19,"DM-35","DOORMAAT",null,0,"B_DORNMASS","DO35"]
[19,"DM-40","DOORMAAT",null,0,"B_DORNMASS","DO40"]
[19,"DM-45","DOORMAAT",null,0,"B_DORNMASS","DO45"]
[19,"DM-50","DOORMAAT",null,0,"B_DORNMASS","DO50"]
[20,"SEW","Seewasser","Ohne G Fuktion Doppelzyl",0,"B_SEEWASSERAUSF","SEW","B_STULPSCHRAUBENAUSF","SA80 SEEW","B_FAERBUNG_AUSSEN","FA004","B_FAERBUNG_INNEN","FI004",null,null,"B"]
[21,"Dwangsluiting-Ja","Dwangsluiting-Ja",null,0,"B_Verriegelung","VRZV"]
[21,"Dwangsluiting-Nee","Dwangsluiting-Nee",null,0,"B_Verriegelung","VRSV"]
[]
[]
[]
[]
[]
[]
[]
[]
[]
[]
[null,null,null,null,null,null,null,null,null,null,null,null,null,null,null,null,1,"Ohne G Fuktion Doppelzyl"]
[null,null,null,null,null,null,null,null,null,null,null,null,null,null,null,null,2,"Mit G Funktion Doppelzyl"]
[null,null,null,null,null,null,null,null,null,null,null,null,null,null,null,null,3,"K2"]
[null,null,null,null,null,null,null,null,null,null,null,null,null,null,null,null,4,382]
[null,null,null,null,null,null,null,null,null,null,null,null,null,null,null,null,6,"419/1"]
[null,null,null,null,null,null,null,null,null,null,null,null,null,null,null,null,7,777]
[null,null,null,null,null,null,null,null,null,null,null,null,null,null,null,null,8,"Ohne G Fuktion Halbzyl"]
[null,null,null,null,null,null,null,null,null,null,null,null,null,null,null,null,9,"Mit G Funktion Halbzyl"]
[null,null,null,null,null,null,null,null,null,null,null,null,null,null,null,null,10,3020]
[null,null,null,null,null,null,null,null,null,null,null,null,null,null,null,null,11,"333RI"]
[null,null,null,null,null,null,null,null,null,null,null,null,null,null,null,null,12,"Blindzyl"]
[null,null,null,null,null,null,null,null,null,null,null,null,null,null,null,null,13,"Ohne T und G"]
[]
[]
[]
[]
[]
[null,null,null,null,null,null,null,null,null,null,null,null,null,null,null,null,6,"419/1"]
[]
[null,null,null,null,null,null,null,null,null,null,null,null,null,null,null,null,2,"Mit G Funktion Doppelzyl"]
[]
[]
[]
[]
[]
[]
[]
[]
[]
[]
[]
[]
[]
[]
[]
[]
[]
[]
[]
[]
[]
[]
[]
[]
[]
[]
[]
[]
[]
[null,null,null,null,null,null,null,null,null,null,null,null,null,null,null,null,4,382]
[]
[]
[]
[null,null,null,null,null,null,null,null,null,null,null,null,null,null,null,null,3,"K2"]
[null,null,null,null,null,null,null,null,null,null,null,null,null,null,null,null,4,382]
[]
[]
[]
[null,null,null,null,null,null,null,null,null,null,null,null,null,null,null,null,3,"K2"]

{"sheet":"Farbe","index":9,"n_rows":93,"n_cols":13,"rows_kept":93,"cut":false,"hidden":true,"merged":[]}
["ID","Nummer","Name","Aufpreis Halbzylinder","MName1","MWert1","MNAME2","MWERT2","netto",null,null,"Tabelle","Name"]
[0,null,"ohne",0,null,null,null,null,"B"]
[1,"01","matt vernickelt",0,"B_FAERBUNG_AUSSEN","FA001","B_FAERBUNG_INNEN","FI001","B",null,null,0,"ohne"]
[1,"03","Mattverchromt",12.79,"B_FAERBUNG_AUSSEN","FA003","B_FAERBUNG_INNEN","FI003","B",null,null,1,"messing"]
[1,"04","Glanzverchromt",12.79,"B_FAERBUNG_AUSSEN","FA004","B_FAERBUNG_INNEN","FI004","B",null,null,2,"Stahl"]
[1,"04-S","Glanzverchromt",19.09,"B_FAERBUNG_AUSSEN","FA004","B_FAERBUNG_INNEN","FI004","B",null,null,3,"Duracast"]
[1,"05","messing matt gebürstet",12.79,"B_FAERBUNG_AUSSEN","FA005","B_FAERBUNG_INNEN","FI005","B",null,null,4,"messing halbzylinder"]
[1,"06","messing poliert",12.79,"B_FAERBUNG_AUSSEN","FA006","B_FAERBUNG_INNEN","FI006","B",null,null,5,"Stahl halbzylinder"]
[1,"07","messing brüniert",12.79,"B_FAERBUNG_AUSSEN","FA007","B_FAERBUNG_INNEN","FA007","B",null,null,6,"Duracast halbzylinder"]
[1,"09","altdeutsch",12.79,"B_FAERBUNG_AUSSEN","FA009","B_FAERBUNG_INNEN","FI009","B",null,null,7,"GAMMA"]
[1,"25","vergoldet",12.79,"B_FAERBUNG_AUSSEN","FA025","B_FAERBUNG_INNEN","FA025","B",null,null,8,"GAMMA HALF"]
[1,null,null,0,null,null,null,null,"B",null,null,9,"419 Lips"]
[2,"01","matt vernickelt",12.79,"B_FAERBUNG_AUSSEN","FA001","B_FAERBUNG_INNEN","FI001","B",null,null,10,"AM Knop K7"]
[2,"03","Mattverchromt",12.79,"B_FAERBUNG_AUSSEN","FA003","B_FAERBUNG_INNEN","FI003","B",null,null,11,"RS-Sigma messing"]
[2,"04","Glanzverchromt",12.79,"B_FAERBUNG_AUSSEN","FA004","B_FAERBUNG_INNEN","FI004","B",null,null,12,"RS-Sigma messing Half"]
[2,"04-S","Glanzverchromt",19.09,"B_FAERBUNG_AUSSEN","FA004","B_FAERBUNG_INNEN","FI004","B"]
[2,"50","messing matt gebürstet",12.79,"B_FAERBUNG_AUSSEN","FA050","B_FAERBUNG_INNEN","FI050","B"]
[2,"51","messing poliert",12.79,"B_FAERBUNG_AUSSEN","FA051","B_FAERBUNG_INNEN","FI051","B"]
[2,"00","edelsahl matt",0,"B_FAERBUNG_AUSSEN",null,"B_FAERBUNG_INNEN",null,"B"]
[2,null,null,0,null,null,null,null,"B"]
[3,"01","matt vernickelt",0,"B_FAERBUNG_AUSSEN","FA001","B_FAERBUNG_INNEN","FI001","B"]
[3,"03","Mattverchromt",12.79,"B_FAERBUNG_AUSSEN","FA003","B_FAERBUNG_INNEN","FI003","B"]
[3,"04","Glanzverchromt",12.79,"B_FAERBUNG_AUSSEN","FA004","B_FAERBUNG_INNEN","FI004","B"]
[3,"04-S","Glanzverchromt",19.09,"B_FAERBUNG_AUSSEN","FA004","B_FAERBUNG_INNEN","FI004","B"]
[3,"50","messing matt gebürstet",12.79,"B_FAERBUNG_AUSSEN","FA050","B_FAERBUNG_INNEN","FI050","B"]
[3,"51","messing poliert",12.79,"B_FAERBUNG_AUSSEN","FA051","B_FAERBUNG_INNEN","FI051","B"]
[3,null,null,0,null,null,null,null,"B"]
[4,"01","matt vernickelt",0,"B_FAERBUNG_AUSSEN","FA001",null,null,"B"]
[4,"03","Mattverchromt",12.79,"B_FAERBUNG_AUSSEN","FA003",null,null,"B"]
[4,"04","Glanzverchromt",12.79,"B_FAERBUNG_AUSSEN","FA004",null,null,"B"]
[4,"04-S","Glanzverchromt",19.09,"B_FAERBUNG_AUSSEN","FA004",null,null,"B"]
[4,"05","messing matt gebürstet",12.79,"B_FAERBUNG_AUSSEN","FA005",null,null,"B"]
[4,"06","messing poliert",12.79,"B_FAERBUNG_AUSSEN","FA006",null,null,"B"]
[4,"07","messing brüniert",12.79,"B_FAERBUNG_AUSSEN","FA007",null,null,"B"]
[4,"09","altdeutsch",12.79,"B_FAERBUNG_AUSSEN","FA009",null,null,"B"]
[4,"25","vergoldet",12.79,"B_FAERBUNG_AUSSEN","FA025",null,null,"B"]
[4,null,null,0,null,null,null,null,"B"]
[5,"01","matt vernickelt",12.79,"B_FAERBUNG_AUSSEN","FA001",null,null,"B"]
[5,"03","Mattverchromt",12.79,"B_FAERBUNG_AUSSEN","FA003",null,null,"B"]
[5,"04","Glanzverchromt",12.79,"B_FAERBUNG_AUSSEN","FA004",null,null,"B"]
[5,"04-S","Glanzverchromt",19.09,"B_FAERBUNG_AUSSEN","FA004",null,null,"B"]
[5,"50","messing matt gebürstet",12.79,"B_FAERBUNG_AUSSEN","FA050",null,null,"B"]
[5,"51","messing poliert",12.79,"B_FAERBUNG_AUSSEN","FA051",null,null,"B"]
[5,"00","edelsahl matt",0,"B_FAERBUNG_AUSSEN",null,null,null,"B"]
[5,null,null,0,null,null,null,null,"B"]
[6,"01","matt vernickelt",0,"B_FAERBUNG_AUSSEN","FA001",null,null,"B"]
[6,"03","Mattverchromt",12.79,"B_FAERBUNG_AUSSEN","FA003",null,null,"B"]
[6,"04","Glanzverchromt",12.79,"B_FAERBUNG_AUSSEN","FA004",null,null,"B"]
[6,"04-S","Glanzverchromt",19.09,"B_FAERBUNG_AUSSEN","FA004",null,null,"B"]
[6,"50.","messing matt gebürstet",12.79,"B_FAERBUNG_AUSSEN","FA050",null,null,"B"]
[6,"51","messing poliert",12.79,"B_FAERBUNG_AUSSEN","FA051",null,null,"B"]
[6,null,null,0,null,null,null,null,"B"]
[7,"01","matt vernickelt",0,"B_FAERBUNG_AUSSEN","FA001","B_FAERBUNG_INNEN","FI001","B"]
[7,"04","Glanzverchromt",12.79,"B_FAERBUNG_AUSSEN","FA004","B_FAERBUNG_INNEN","FI004","B"]
[7,"04-S","Glanzverchromt",19.09,"B_FAERBUNG_AUSSEN","FA004","B_FAERBUNG_INNEN","FI004","B"]
[7,"05","messing matt gebürstet",12.79,"B_FAERBUNG_AUSSEN","FA005","B_FAERBUNG_INNEN","FI005","B"]
[7,"06","messing poliert",12.79,"B_FAERBUNG_AUSSEN","FA006","B_FAERBUNG_INNEN","FI006","B"]
[7,"07","messing brüniert",12.79,"B_FAERBUNG_AUSSEN","FA007","B_FAERBUNG_INNEN","FA007","B"]
[7,"09","altdeutsch",12.79,"B_FAERBUNG_AUSSEN","FA009","B_FAERBUNG_INNEN","FI009","B"]
[7,"25","vergoldet",12.79,"B_FAERBUNG_AUSSEN","FA025","B_FAERBUNG_INNEN","FA025","B"]
[7,null,null,0,null,null,null,null,"B"]
[8,"01","matt vernickelt",0,"B_FAERBUNG_AUSSEN","FA001",null,null,"B"]
[8,"04","Glanzverchromt",12.79,"B_FAERBUNG_AUSSEN","FA004",null,null,"B"]
[8,"04-S","Glanzverchromt",19.09,"B_FAERBUNG_AUSSEN","FA004",null,null,"B"]
[8,"05","messing matt gebürstet",12.79,"B_FAERBUNG_AUSSEN","FA005",null,null,"B"]
[8,"06","messing poliert",12.79,"B_FAERBUNG_AUSSEN","FA006",null,null,"B"]
[8,"07","messing brüniert",12.79,"B_FAERBUNG_AUSSEN","FA007",null,null,"B"]
[8,"09","altdeutsch",12.79,"B_FAERBUNG_AUSSEN","FA009",null,null,"B"]
[8,"25","vergoldet",12.79,"B_FAERBUNG_AUSSEN","FA025",null,null,"B"]
[8,null,null,0,null,null,null,null,"B"]
[9,"01","matt vernickelt",0,"B_FAERBUNG_AUSSEN","FA001","B_FAERBUNG_INNEN","FI001","B"]
[10,"01","matt vernickelt",0,"B_FAERBUNG_AUSSEN","FA001","B_FAERBUNG_INNEN","FI001","B"]
[10,"06","messing poliert",12.79,"B_FAERBUNG_AUSSEN","FA006","B_FAERBUNG_INNEN","FI006","B"]
[11,"01","matt vernickelt",0,"B_FAERBUNG_AUSSEN","FA001","B_FAERBUNG_INNEN","FI001","B"]
[11,"03","Mattverchromt",12.79,"B_FAERBUNG_AUSSEN","FA003","B_FAERBUNG_INNEN","FI003","B"]
[11,"04","Glanzverchromt",12.79,"B_FAERBUNG_AUSSEN","FA004","B_FAERBUNG_INNEN","FI004","B"]
[11,"04-S","Glanzverchromt",19.09,"B_FAERBUNG_AUSSEN","FA004","B_FAERBUNG_INNEN","FI004","B"]
[11,"05","messing matt gebürstet",12.79,"B_FAERBUNG_AUSSEN","FA005","B_FAERBUNG_INNEN","FI005","B"]
[11,"06","messing poliert",12.79,"B_FAERBUNG_AUSSEN","FA006","B_FAERBUNG_INNEN","FI006","B"]
[11,"07","messing brüniert",12.79,"B_FAERBUNG_AUSSEN","FA007","B_FAERBUNG_INNEN","FI007","B"]
[11,"09","altdeutsch",12.79,"B_FAERBUNG_AUSSEN","FA009","B_FAERBUNG_INNEN","FI009","B"]
[11,"17","Zwart",12.79,"B_FAERBUNG_AUSSEN","FA017","B_FAERBUNG_INNEN","FI017","B"]
[11,"25","vergoldet",12.79,"B_FAERBUNG_AUSSEN","FA025","B_FAERBUNG_INNEN","FI025","B"]
[12,"01","matt vernickelt",0,"B_FAERBUNG_AUSSEN","FA001",null,null,"B"]
[12,"03","Mattverchromt",12.79,"B_FAERBUNG_AUSSEN","FA003",null,null,"B"]
[12,"04","Glanzverchromt",12.79,"B_FAERBUNG_AUSSEN","FA004",null,null,"B"]
[12,"04-S","Glanzverchromt",19.09,"B_FAERBUNG_AUSSEN","FA004",null,null,"B"]
[12,"05","messing matt gebürstet",12.79,"B_FAERBUNG_AUSSEN","FA005",null,null,"B"]
[12,"06","messing poliert",12.79,"B_FAERBUNG_AUSSEN","FA006",null,null,"B"]
[12,"07","messing brüniert",12.79,"B_FAERBUNG_AUSSEN","FA007",null,null,"B"]
[12,"09","altdeutsch",12.79,"B_FAERBUNG_AUSSEN","FA009",null,null,"B"]
[12,"17","Zwart",12.79,"B_FAERBUNG_AUSSEN","FA017",null,null,"B"]
[12,"25","vergoldet",12.79,"B_FAERBUNG_AUSSEN","FA025",null,null,"B"]

{"sheet":"Längen","index":10,"n_rows":1551,"n_cols":15,"rows_kept":1551,"cut":false,"hidden":true,"merged":[]}
["ID","A","B","Gesamt","Text","VLA","VLB","Aufpreis","Netto"]
[0,"*","*","*",null,"*","*",0,"B",0,"ohne Längen",null,"Aufpreis","€"]
[1,30,30,{"$f":"B3+C3","v":60},{"$f":"CONCATENATE(B3,\" / \",C3)","v":"30 / 30"},{"$f":"ROUNDDOWN((B3-30) /5,0)","v":0},{"$f":"ROUNDDOWN((C3-30) /5,0)","v":0},{"$f":"(G3+F3)*N$3","v":0},"B",1,"Messing ","N3","Messing <=100",5.86,"je 5mm"]
[1,30,35,65,"30 / 35",0,1,5.86,"B",2,"Stahl","N5","Messing > 100",5.86,"je 5mm"]
[1,30,40,70,"30 / 40",0,2,11.72,"B",3,"Modular","N5","Stahl alle langen",9.42,"je 5mm"]
[1,30,45,75,"30 / 45",0,3,17.580000000000002,"B",4,"Halb messing","N3","duracast alle langen",9.42,"je 5mm"]
[1,30,50,80,"30 / 50",0,4,23.44,"B",5,"Kurz/Lang"," ","Modular  alle langen ",9.42,"je 5mm"]
[1,30,55,85,"30 / 55",0,5,29.3,"B",6,"Kurz/Kurz"," ","GAMMA",5.86,"je 5mm"]
[1,30,60,90,"30 / 60",0,6,35.160000000000004,"B",10,"Halb Stahl","N5","GAMMA MODULAIR",9.42,"je 5mm"]
[1,30,65,95,"30 / 65",0,7,41.02,"B",17,"Modular Halb","N5"]
[1,30,70,100,"30 / 70",0,8,46.88,"B",18,"Duracast","N5"]
[1,30,75,105,"30 / 75",0,9,52.74,"B",19,"Halb Duracast","N5"]
[1,30,80,110,"30 / 80",0,10,58.6,"B",24,"Messing vrijloop IX frl vanaf 35/35"]
[1,35,30,65,"35 / 30",1,0,5.86,"B",25,"Halb messing vrijloop IX"]
[1,35,35,70,"35 / 35",1,1,11.72,"B",26,"Messing Keso"]
[1,35,40,75,"35 / 40",1,2,17.580000000000002,"B",27,"Halb messing Keso"]
[1,35,45,80,"35 / 45",1,3,23.44,"B",30,"Knop K7 max 60/60"]
[1,35,50,85,"35 / 50",1,4,29.3,"B",31,"Knop K7 Modulair max 60/60"]
[1,35,55,90,"35 / 55",1,5,35.160000000000004,"B",7,444,"NVT"]
[1,35,60,95,"35 / 60",1,6,41.02,"B",8,633,"NVT"]
[1,35,65,100,"35 / 65",1,7,46.88,"B",9,"666H","NVT"]
[1,35,70,105,"35 / 70",1,8,52.74,"B",12,"S6 35 / 35","NVT"]
[1,35,75,110,"35 / 75",1,9,58.6,"B",13,"S6 MX","NVT"]
[1,35,80,115,"35 / 80",1,10,64.460000000000008,"B",14,"S6H 35","NVT"]
[1,40,30,70,"40 / 30",2,0,11.72,"B",15,"S6H MX","NVT"]
[1,40,35,75,"40 / 35",2,1,17.580000000000002,"B",16,"Blind","NVT"]
[1,40,40,80,"40 / 40",2,2,23.44,"B",20,"GAMMA","NVT"]
[1,40,45,85,"40 / 45",2,3,29.3,"B",22,"GAMMA MODU.","NVT"]
[1,40,50,90,"40 / 50",2,4,35.160000000000004,"B",28,"Modular vrijloop >35/35","NVT"]
[1,40,55,95,"40 / 55",2,5,41.02,"B",29,"Modular Halb vrijloop >35","NVT"]
[1,40,60,100,"40 / 60",2,6,46.88,"B",33,"MESSING IX MET SKG2 60/60 MAX"," "]
[1,40,65,105,"40 / 65",2,7,52.74,"B",21,"GAMMA HALF","NVT"]
[1,40,70,110,"40 / 70",2,8,58.6,"B",23,"GAMMA MODU.HALF","NVT"]
[1,40,75,115,"40 / 75",2,9,64.460000000000008,"B",35,"twinstarh skg2 tot 0/50"]
[1,40,80,120,"40 / 80",2,10,70.320000000000007,"B"]
[1,45,30,75,"45 / 30",3,0,17.580000000000002,"B"]
[1,45,35,80,"45 / 35",3,1,23.44,"B"]
[1,45,40,85,"45 / 40",3,2,29.3,"B"]
[1,45,45,90,"45 / 45",3,3,35.160000000000004,"B"]
[1,45,50,95,"45 / 50",3,4,41.02,"B"]
[1,45,55,100,"45 / 55",3,5,46.88,"B"]
[1,45,60,105,"45 / 60",3,6,52.74,"B"]
[1,45,65,110,"45 / 65",3,7,58.6,"B"]
[1,45,70,115,"45 / 70",3,8,64.460000000000008,"B"]
[1,50,30,80,"50 / 30",4,0,23.44,"B"]
[1,50,35,85,"50 / 35",4,1,29.3,"B"]
[1,50,40,90,"50 / 40",4,2,35.160000000000004,"B"]
[1,50,45,95,"50 / 45",4,3,41.02,"B"]
[1,50,50,100,"50 / 50",4,4,46.88,"B"]
[1,50,55,105,"50 / 55",4,5,52.74,"B"]
[1,50,60,110,"50 / 60",4,6,58.6,"B"]
[1,50,65,115,"50 / 65",4,7,64.460000000000008,"B"]
[1,50,70,120,"50 / 70",4,8,70.320000000000007,"B"]
[1,55,30,85,"55 / 30",5,0,29.3,"B"]
[1,55,35,90,"55 / 35",5,1,35.160000000000004,"B"]
[1,55,40,95,"55 / 40",5,2,41.02,"B"]
[1,55,45,100,"55 / 45",5,3,46.88,"B"]
[1,55,50,105,"55 / 50",5,4,52.74,"B"]
[1,55,55,110,"55 / 55",5,5,58.6,"B"]
[1,55,60,115,"55 / 60",5,6,64.460000000000008,"B"]
[1,55,65,120,"55 / 65",5,7,70.320000000000007,"B"]
[1,60,30,90,"60 / 30",6,0,35.160000000000004,"B"]
[1,60,35,95,"60 / 35",6,1,41.02,"B"]
[1,60,40,100,"60 / 40",6,2,46.88,"B"]
[1,60,45,105,"60 / 45",6,3,52.74,"B"]
[1,60,50,110,"60 / 50",6,4,58.6,"B"]
[1,60,55,{"$f":"B67+C67","v":115},{"$f":"CONCATENATE(B67,\" / \",C67)","v":"60 / 55"},6,5,{"$f":"(G67+F67)*N$3","v":64.460000000000008},"B"]
[1,60,60,120,"60 / 60",6,6,70.320000000000007,"B"]
[1,65,30,95,"65 / 30",7,0,41.02,"B"]
[1,65,35,100,"65 / 35",7,1,46.88,"B"]
[1,65,40,105,"65 / 40",7,2,52.74,"B"]
[1,65,45,110,"65 / 45",7,3,58.6,"B"]
[1,65,50,115,"65 / 50",7,4,64.460000000000008,"B"]
[1,65,55,120,"65 / 55",7,5,70.320000000000007,"B"]
[1,70,30,100,"70 / 30",8,0,46.88,"B"]
[1,70,35,105,"70 / 35",8,1,52.74,"B"]
[1,70,40,110,"70 / 40",8,2,58.6,"B"]
[1,70,45,115,"70 / 45",8,3,64.460000000000008,"B"]
[1,70,50,120,"70 / 50",8,4,70.320000000000007,"B"]
[1,75,30,105,"75 / 30",9,0,52.74,"B"]
[1,75,35,110,"75 / 35",9,1,58.6,"B"]
[1,75,40,115,"75 / 40",9,2,64.460000000000008,"B"]
[1,80,30,110,"80 / 30",10,0,58.6,"B"]
[1,80,35,115,"80 / 35",10,1,64.460000000000008,"B"]
[1,80,40,120,"80 / 40",10,2,70.320000000000007,"B"]
[2,32,32,64,"32 / 32",0,0,0,"B"]
[2,32,37,69,"32 / 37",0,1,{"$f":"(G87+F87)*N$5","v":9.42},"B"]
[2,32,42,74,"32 / 42",0,2,18.84,"B"]
[2,32,47,79,"32 / 47",0,3,28.259999999999998,"B"]
[2,32,52,84,"32 / 52",0,4,37.68,"B"]
[2,32,57,89,"32 / 57",0,5,47.1,"B"]
[2,32,62,94,"32 / 62",0,6,56.519999999999996,"B"]
[2,32,67,99,"32 / 67",0,7,65.94,"B"]
[2,32,72,104,"32 / 72",0,8,75.36,"B"]
[2,32,82,114,"32 / 82",0,10,94.2,"B"]
[2,32,92,124,"32 / 92",0,12,113.03999999999999,"B"]
[2,32,102,134,"32 / 102",0,14,131.88,"B"]
[2,32,112,144,"32 / 112",0,16,150.72,"B"]
[2,32,122,154,"32 / 122",0,18,169.56,"B"]
[2,32,132,164,"32 / 132",0,20,188.4,"B"]
[2,37,32,69,"37 / 32",1,0,9.42,"B"]
[2,37,37,74,"37 / 37",1,1,18.84,"B"]
[2,37,42,79,"37 / 42",1,2,28.259999999999998,"B"]
[2,37,47,84,"37 / 47",1,3,37.68,"B"]
[2,37,52,89,"37 / 52",1,4,47.1,"B"]
[2,37,57,94,"37 / 57",1,5,56.519999999999996,"B"]
[2,37,62,99,"37 / 62",1,6,65.94,"B"]
[2,37,67,104,"37 / 67",1,7,75.36,"B"]
[2,42,32,74,"42 / 32",2,0,18.84,"B"]
[2,42,37,79,"42 / 37",2,1,28.259999999999998,"B"]
[2,42,42,84,"42 / 42",2,2,37.68,"B"]
[2,42,47,89,"42 / 47",2,3,47.1,"B"]
[2,42,52,94,"42 / 52",2,4,56.519999999999996,"B"]
[2,42,57,99,"42 / 57",2,5,65.94,"B"]
[2,42,62,104,"42 / 62",2,6,75.36,"B"]
[2,42,67,109,"42 / 67",2,7,84.78,"B"]
[2,42,72,114,"42 / 72",2,8,94.2,"B"]
[2,42,82,124,"42 / 82",2,10,113.03999999999999,"B"]
[2,42,92,134,"42 / 92",2,12,131.88,"B"]
[2,42,102,144,"42 / 102",2,14,150.72,"B"]
[2,42,112,154,"42 / 112",2,16,169.56,"B"]
[2,42,122,164,"42 / 122",2,18,188.4,"B"]
[2,42,132,174,"42 / 132",2,20,207.24,"B"]
[2,47,32,79,"47 / 32",3,0,28.259999999999998,"B"]
[2,47,37,84,"47 / 37",3,1,37.68,"B"]
[2,47,42,89,"47 / 42",3,2,47.1,"B"]
[2,47,47,94,"47 / 47",3,3,56.519999999999996,"B"]
[2,47,52,99,"47 / 52",3,4,65.94,"B"]
[2,47,57,104,"47 / 57",3,5,75.36,"B"]
[2,47,62,109,"47 / 62",3,6,84.78,"B"]
[2,47,67,{"$f":"B131+C131","v":114},{"$f":"CONCATENATE(B131,\" / \",C131)","v":"47 / 67"},3,7,94.2,"B"]
[2,52,32,84,"52 / 32",4,0,37.68,"B"]
[2,52,37,89,"52 / 37",4,1,47.1,"B"]
[2,52,42,94,"52 / 42",4,2,56.519999999999996,"B"]
[2,52,47,99,"52 / 47",4,3,65.94,"B"]
[2,52,52,104,"52 / 52",4,4,75.36,"B"]
[2,52,57,109,"52 / 57",4,5,84.78,"B"]
[2,52,62,114,"52 / 62",4,6,94.2,"B"]
[2,52,67,119,"52 / 67",4,7,103.62,"B"]
[2,52,72,124,"52 / 72",4,8,113.03999999999999,"B"]
[2,52,82,134,"52 / 82",4,10,131.88,"B"]
[2,52,92,144,"52 / 92",4,12,150.72,"B"]
[2,52,102,154,"52 / 102",4,14,169.56,"B"]
[2,52,112,164,"52 / 112",4,16,188.4,"B"]
[2,52,122,174,"52 / 122",4,18,207.24,"B"]
[2,52,132,184,"52 / 132",4,20,226.07999999999998,"B"]
[2,57,32,89,"57 / 32",5,0,47.1,"B"]
[2,57,37,94,"57 / 37",5,1,56.519999999999996,"B"]
[2,57,42,99,"57 / 42",5,2,65.94,"B"]
[2,57,47,104,"57 / 47",5,3,75.36,"B"]
[2,57,52,109,"57 / 52",5,4,{"$f":"(G151+F151)*N$5","v":84.78},"B"]
[2,57,57,114,"57 / 57",5,5,94.2,"B"]
[2,57,62,119,"57 / 62",5,6,103.62,"B"]
[2,57,67,124,"57 / 67",5,7,113.03999999999999,"B"]
[2,62,32,94,"62 / 32",6,0,56.519999999999996,"B"]
[2,62,37,99,"62 / 37",6,1,65.94,"B"]
[2,62,42,104,"62 / 42",6,2,75.36,"B"]
[2,62,47,109,"62 / 47",6,3,84.78,"B"]
[2,62,52,114,"62 / 52",6,4,94.2,"B"]
[2,62,57,119,"62 / 57",6,5,103.62,"B"]
[2,62,62,124,"62 / 62",6,6,113.03999999999999,"B"]
[2,62,67,129,"62 / 67",6,7,122.46,"B"]
[2,62,72,134,"62 / 72",6,8,131.88,"B"]
[2,62,82,144,"62 / 82",6,10,150.72,"B"]
[2,62,92,154,"62 / 92",6,12,169.56,"B"]
[2,62,102,164,"62 / 102",6,14,188.4,"B"]
[2,62,112,174,"62 / 112",6,16,207.24,"B"]
[2,62,122,184,"62 / 122",6,18,226.07999999999998,"B"]
[2,62,132,194,"62 / 132",6,20,244.92,"B"]
[2,67,32,99,"67 / 32",7,0,65.94,"B"]
[2,67,37,104,"67 / 37",7,1,75.36,"B"]
[2,67,42,109,"67 / 42",7,2,84.78,"B"]
[2,67,47,114,"67 / 47",7,3,94.2,"B"]
[2,67,52,119,"67 / 52",7,4,103.62,"B"]
[2,67,57,124,"67 / 57",7,5,113.03999999999999,"B"]
[2,67,62,129,"67 / 62",7,6,122.46,"B"]
[2,67,67,134,"67 / 67",7,7,131.88,"B"]
[2,72,32,104,"72 / 32",8,0,75.36,"B"]
[2,72,42,114,"72 / 42",8,2,94.2,"B"]
[2,72,52,124,"72 / 52",8,4,113.03999999999999,"B"]
[2,72,62,134,"72 / 62",8,6,131.88,"B"]
[2,72,72,144,"72 / 72",8,8,150.72,"B"]
[2,72,82,154,"72 / 82",8,10,169.56,"B"]
[2,72,92,164,"72 / 92",8,12,188.4,"B"]
[2,72,102,174,"72 / 102",8,14,207.24,"B"]
[2,72,112,184,"72 / 112",8,16,226.07999999999998,"B"]
[2,72,122,194,"72 / 122",8,18,244.92,"B"]
[2,72,132,204,"72 / 132",8,20,263.76,"B"]
[2,82,32,114,"82 / 32",10,0,94.2,"B"]
[2,82,42,124,"82 / 42",10,2,113.03999999999999,"B"]
[2,82,52,134,"82 / 52",10,4,131.88,"B"]
[2,82,62,144,"82 / 62",10,6,150.72,"B"]
[2,82,72,154,"82 / 72",10,8,169.56,"B"]
[2,82,82,164,"82 / 82",10,10,188.4,"B"]
[2,82,92,{"$f":"B195+C195","v":174},{"$f":"CONCATENATE(B195,\" / \",C195)","v":"82 / 92"},10,12,207.24,"B"]
[2,82,102,184,"82 / 102",10,14,226.07999999999998,"B"]
[2,82,112,194,"82 / 112",10,16,244.92,"B"]
[2,82,122,204,"82 / 122",10,18,263.76,"B"]
[2,82,132,214,"82 / 132",10,20,282.60000000000002,"B"]
[2,92,32,124,"92 / 32",12,0,113.03999999999999,"B"]
[2,92,42,134,"92 / 42",12,2,131.88,"B"]
[2,92,52,144,"92 / 52",12,4,150.72,"B"]
[2,92,62,154,"92 / 62",12,6,169.56,"B"]
[2,92,72,164,"92 / 72",12,8,188.4,"B"]
[2,92,82,174,"92 / 82",12,10,207.24,"B"]
[2,92,92,184,"92 / 92",12,12,226.07999999999998,"B"]
[2,92,102,194,"92 / 102",12,14,244.92,"B"]
[2,92,112,204,"92 / 112",12,16,263.76,"B"]
[2,92,122,214,"92 / 122",12,18,282.60000000000002,"B"]
[2,92,132,224,"92 / 132",12,20,301.44,"B"]
[2,102,32,134,"102 / 32",14,0,131.88,"B"]
[2,102,42,144,"102 / 42",14,2,150.72,"B"]
[2,102,52,154,"102 / 52",14,4,169.56,"B"]
[2,102,62,164,"102 / 62",14,6,188.4,"B"]
[2,102,72,174,"102 / 72",14,8,{"$f":"(G215+F215)*N$5","v":207.24},"B"]
[2,102,82,184,"102 / 82",14,10,226.07999999999998,"B"]
[2,102,92,194,"102 / 92",14,12,244.92,"B"]
[2,102,102,204,"102 / 102",14,14,263.76,"B"]
[2,102,112,214,"102 / 112",14,16,282.60000000000002,"B"]
[2,102,122,224,"102 / 122",14,18,301.44,"B"]
[2,102,132,234,"102 / 132",14,20,320.27999999999997,"B"]
[2,112,32,144,"112 / 32",16,0,150.72,"B"]
[2,112,42,154,"112 / 42",16,2,169.56,"B"]
[2,112,52,164,"112 / 52",16,4,188.4,"B"]
[2,112,62,174,"112 / 62",16,6,207.24,"B"]
[2,112,72,184,"112 / 72",16,8,226.07999999999998,"B"]
[2,112,82,194,"112 / 82",16,10,244.92,"B"]
[2,112,92,204,"112 / 92",16,12,263.76,"B"]
[2,112,102,214,"112 / 102",16,14,282.60000000000002,"B"]
[2,112,112,224,"112 / 112",16,16,301.44,"B"]
[2,112,122,234,"112 / 122",16,18,320.27999999999997,"B"]
[2,112,132,244,"112 / 132",16,20,339.12,"B"]
[2,122,32,154,"122 / 32",18,0,169.56,"B"]
[2,122,42,164,"122 / 42",18,2,188.4,"B"]
[2,122,52,174,"122 / 52",18,4,207.24,"B"]
[2,122,62,184,"122 / 62",18,6,226.07999999999998,"B"]
[2,122,72,194,"122 / 72",18,8,244.92,"B"]
[2,122,82,204,"122 / 82",18,10,263.76,"B"]
[2,122,92,214,"122 / 92",18,12,282.60000000000002,"B"]
[2,122,102,224,"122 / 102",18,14,301.44,"B"]
[2,122,112,234,"122 / 112",18,16,320.27999999999997,"B"]
[2,122,122,244,"122 / 122",18,18,339.12,"B"]
[2,122,132,254,"122 / 132",18,20,357.96,"B"]
[2,132,32,164,"132 / 32",20,0,188.4,"B"]
[2,132,42,174,"132 / 42",20,2,207.24,"B"]
[2,132,52,184,"132 / 52",20,4,226.07999999999998,"B"]
[2,132,62,194,"132 / 62",20,6,244.92,"B"]
[2,132,72,204,"132 / 72",20,8,263.76,"B"]
[2,132,82,214,"132 / 82",20,10,282.60000000000002,"B"]
[2,132,92,224,"132 / 92",20,12,301.44,"B"]
[2,132,102,234,"132 / 102",20,14,320.27999999999997,"B"]
[2,132,112,244,"132 / 112",20,16,339.12,"B"]
[2,132,122,254,"132 / 122",20,18,357.96,"B"]
[2,132,132,264,"132 / 132",20,20,376.8,"B"]
[3,30,30,60,"30 / 30",0,0,0,"B"]
[3,30,35,65,"30 / 35",0,1,9.42,"B"]
[3,30,40,70,"30 / 40",0,2,18.84,"B"]
[3,30,45,75,"30 / 45",0,3,28.259999999999998,"B"]
[3,30,50,{"$f":"B259+C259","v":80},{"$f":"CONCATENATE(B259,\" / \",C259)","v":"30 / 50"},0,4,37.68,"B"]
[3,30,55,85,"30 / 55",0,5,47.1,"B"]
[3,30,60,90,"30 / 60",0,6,56.519999999999996,"B"]
[3,30,65,95,"30 / 65",0,7,65.94,"B"]
[3,30,70,100,"30 / 70",0,8,75.36,"B"]
[3,30,75,105,"30 / 75",0,9,84.78,"B"]
[3,30,80,110,"30 / 80",0,10,94.2,"B"]
[3,30,85,115,"30 / 85",0,11,103.62,"B"]
[3,30,90,120,"30 / 90",0,12,113.03999999999999,"B"]
[3,30,95,125,"30 / 95",0,13,122.46,"B"]
[3,30,100,130,"30 / 100",0,14,131.88,"B"]
[3,30,105,135,"30 / 105",0,15,141.30000000000001,"B"]
[3,30,110,140,"30 / 110",0,16,150.72,"B"]
[3,30,115,145,"30 / 115",0,17,160.13999999999999,"B"]
[3,30,120,150,"30 / 120",0,18,169.56,"B"]
[3,30,125,155,"30 / 125",0,19,178.98,"B"]
[3,30,130,160,"30 / 130",0,20,188.4,"B"]
[3,30,135,165,"30 / 135",0,21,197.82,"B"]
[3,30,140,170,"30 / 140",0,22,207.24,"B"]
[3,30,145,175,"30 / 145",0,23,216.66,"B"]
[3,30,150,180,"30 / 150",0,24,{"$f":"(G279+F279)*N$5","v":226.07999999999998},"B"]
[3,30,155,185,"30 / 155",0,25,235.5,"B"]
[3,30,160,190,"30 / 160",0,26,244.92,"B"]
[3,30,165,195,"30 / 165",0,27,254.34,"B"]
[3,30,170,200,"30 / 170",0,28,263.76,"B"]
[3,30,175,205,"30 / 175",0,29,273.18,"B"]
[3,30,180,210,"30 / 180",0,30,282.60000000000002,"B"]
[3,30,185,215,"30 / 185",0,31,292.02,"B"]
[3,30,190,220,"30 / 190",0,32,301.44,"B"]
[3,30,195,225,"30 / 195",0,33,310.86,"B"]
[3,30,200,230,"30 / 200",0,34,320.27999999999997,"B"]
[3,30,210,240,"30 / 210",0,36,339.12,"B"]
[3,35,30,65,"35 / 30",1,0,9.42,"B"]
[3,35,35,70,"35 / 35",1,1,18.84,"B"]
[3,35,40,75,"35 / 40",1,2,28.259999999999998,"B"]
[3,35,45,80,"35 / 45",1,3,37.68,"B"]
[3,35,50,85,"35 / 50",1,4,47.1,"B"]
[3,35,55,90,"35 / 55",1,5,56.519999999999996,"B"]
[3,35,60,95,"35 / 60",1,6,65.94,"B"]
[3,35,65,100,"35 / 65",1,7,75.36,"B"]
[3,35,70,105,"35 / 70",1,8,84.78,"B"]
[3,35,75,110,"35 / 75",1,9,94.2,"B"]
[3,35,80,115,"35 / 80",1,10,103.62,"B"]
[3,35,85,120,"35 / 85",1,11,113.03999999999999,"B"]
[3,35,90,125,"35 / 90",1,12,122.46,"B"]
[3,35,95,130,"35 / 95",1,13,131.88,"B"]
[3,35,100,135,"35 / 100",1,14,141.30000000000001,"B"]
[3,35,105,140,"35 / 105",1,15,150.72,"B"]
[3,35,110,145,"35 / 110",1,16,160.13999999999999,"B"]
[3,35,115,150,"35 / 115",1,17,169.56,"B"]
[3,35,120,155,"35 / 120",1,18,178.98,"B"]
[3,35,125,160,"35 / 125",1,19,188.4,"B"]
[3,35,130,165,"35 / 130",1,20,197.82,"B"]
[3,35,135,170,"35 / 135",1,21,207.24,"B"]
[3,35,140,175,"35 / 140",1,22,216.66,"B"]
[3,35,145,180,"35 / 145",1,23,226.07999999999998,"B"]
[3,35,150,185,"35 / 150",1,24,235.5,"B"]
[3,35,155,190,"35 / 155",1,25,244.92,"B"]
[3,35,160,195,"35 / 160",1,26,254.34,"B"]
[3,35,165,200,"35 / 165",1,27,263.76,"B"]
[3,35,170,205,"35 / 170",1,28,273.18,"B"]
[3,35,175,210,"35 / 175",1,29,282.60000000000002,"B"]
[3,35,180,215,"35 / 180",1,30,292.02,"B"]
[3,35,185,220,"35 / 185",1,31,301.44,"B"]
[3,35,190,{"$f":"B323+C323","v":225},{"$f":"CONCATENATE(B323,\" / \",C323)","v":"35 / 190"},1,32,310.86,"B"]
[3,35,195,230,"35 / 195",1,33,320.27999999999997,"B"]
[3,35,200,235,"35 / 200",1,34,329.7,"B"]
[3,35,210,245,"35 / 210",1,36,348.54,"B"]
[3,40,30,70,"40 / 30",2,0,18.84,"B"]
[3,40,35,75,"40 / 35",2,1,28.259999999999998,"B"]
[3,40,40,80,"40 / 40",2,2,37.68,"B"]
[3,40,45,85,"40 / 45",2,3,47.1,"B"]
[3,40,50,90,"40 / 50",2,4,56.519999999999996,"B"]
[3,40,55,95,"40 / 55",2,5,65.94,"B"]
[3,40,60,100,"40 / 60",2,6,75.36,"B"]
[3,40,65,105,"40 / 65",2,7,84.78,"B"]
[3,40,70,110,"40 / 70",2,8,94.2,"B"]
[3,40,75,115,"40 / 75",2,9,103.62,"B"]
[3,40,80,120,"40 / 80",2,10,113.03999999999999,"B"]
[3,40,85,125,"40 / 85",2,11,122.46,"B"]
[3,40,90,130,"40 / 90",2,12,131.88,"B"]
[3,40,95,135,"40 / 95",2,13,141.30000000000001,"B"]
[3,40,100,140,"40 / 100",2,14,150.72,"B"]
[3,40,105,145,"40 / 105",2,15,160.13999999999999,"B"]
[3,40,110,150,"40 / 110",2,16,{"$f":"(G343+F343)*N$5","v":169.56},"B"]
[3,40,115,155,"40 / 115",2,17,178.98,"B"]
[3,40,120,160,"40 / 120",2,18,188.4,"B"]
[3,40,125,165,"40 / 125",2,19,197.82,"B"]
[3,40,130,170,"40 / 130",2,20,207.24,"B"]
[3,40,135,175,"40 / 135",2,21,216.66,"B"]
[3,40,140,180,"40 / 140",2,22,226.07999999999998,"B"]
[3,40,145,185,"40 / 145",2,23,235.5,"B"]
[3,40,150,190,"40 / 150",2,24,244.92,"B"]
[3,40,155,195,"40 / 155",2,25,254.34,"B"]
[3,40,160,200,"40 / 160",2,26,263.76,"B"]
[3,40,165,205,"40 / 165",2,27,273.18,"B"]
[3,40,170,210,"40 / 170",2,28,282.60000000000002,"B"]
[3,40,175,215,"40 / 175",2,29,292.02,"B"]
[3,40,180,220,"40 / 180",2,30,301.44,"B"]
[3,40,185,225,"40 / 185",2,31,310.86,"B"]
[3,40,190,230,"40 / 190",2,32,320.27999999999997,"B"]
[3,40,195,235,"40 / 195",2,33,329.7,"B"]
[3,40,200,240,"40 / 200",2,34,339.12,"B"]
[3,40,210,250,"40 / 210",2,36,357.96,"B"]
[3,45,30,75,"45 / 30",3,0,28.259999999999998,"B"]
[3,45,35,80,"45 / 35",3,1,37.68,"B"]
[3,45,40,85,"45 / 40",3,2,47.1,"B"]
[3,45,45,90,"45 / 45",3,3,56.519999999999996,"B"]
[3,45,50,95,"45 / 50",3,4,65.94,"B"]
[3,45,55,100,"45 / 55",3,5,75.36,"B"]
[3,45,60,105,"45 / 60",3,6,84.78,"B"]
[3,45,65,110,"45 / 65",3,7,94.2,"B"]
[3,45,70,115,"45 / 70",3,8,103.62,"B"]
[3,45,75,120,"45 / 75",3,9,113.03999999999999,"B"]
[3,45,80,125,"45 / 80",3,10,122.46,"B"]
[3,45,85,130,"45 / 85",3,11,131.88,"B"]
[3,45,90,135,"45 / 90",3,12,141.30000000000001,"B"]
[3,45,95,140,"45 / 95",3,13,150.72,"B"]
[3,45,100,145,"45 / 100",3,14,160.13999999999999,"B"]
[3,45,105,150,"45 / 105",3,15,169.56,"B"]
[3,45,110,155,"45 / 110",3,16,178.98,"B"]
[3,45,115,160,"45 / 115",3,17,188.4,"B"]
[3,45,120,165,"45 / 120",3,18,197.82,"B"]
[3,45,125,170,"45 / 125",3,19,207.24,"B"]
[3,45,130,175,"45 / 130",3,20,216.66,"B"]
[3,45,135,180,"45 / 135",3,21,226.07999999999998,"B"]
[3,45,140,185,"45 / 140",3,22,235.5,"B"]
[3,45,145,190,"45 / 145",3,23,244.92,"B"]
[3,45,150,{"$f":"B387+C387","v":195},{"$f":"CONCATENATE(B387,\" / \",C387)","v":"45 / 150"},3,24,254.34,"B"]
[3,45,155,200,"45 / 155",3,25,263.76,"B"]
[3,45,160,205,"45 / 160",3,26,273.18,"B"]
[3,45,165,210,"45 / 165",3,27,282.60000000000002,"B"]
[3,45,170,215,"45 / 170",3,28,292.02,"B"]
[3,45,175,220,"45 / 175",3,29,301.44,"B"]
[3,45,180,225,"45 / 180",3,30,310.86,"B"]
[3,45,185,230,"45 / 185",3,31,320.27999999999997,"B"]
[3,45,190,235,"45 / 190",3,32,329.7,"B"]
[3,45,195,240,"45 / 195",3,33,339.12,"B"]
[3,45,200,245,"45 / 200",3,34,348.54,"B"]
[3,50,30,80,"50 / 30",4,0,37.68,"B"]
[3,50,35,85,"50 / 35",4,1,47.1,"B"]
[3,50,40,90,"50 / 40",4,2,56.519999999999996,"B"]
[3,50,45,95,"50 / 45",4,3,65.94,"B"]
[3,50,50,100,"50 / 50",4,4,75.36,"B"]
[3,50,55,105,"50 / 55",4,5,84.78,"B"]
[3,50,60,110,"50 / 60",4,6,94.2,"B"]
[3,50,65,115,"50 / 65",4,7,103.62,"B"]
[3,50,70,120,"50 / 70",4,8,113.03999999999999,"B"]
[3,50,75,125,"50 / 75",4,9,{"$f":"(G407+F407)*N$5","v":122.46},"B"]
[3,50,80,130,"50 / 80",4,10,131.88,"B"]
[3,50,85,135,"50 / 85",4,11,141.30000000000001,"B"]
[3,50,90,140,"50 / 90",4,12,150.72,"B"]
[3,50,95,145,"50 / 95",4,13,160.13999999999999,"B"]
[3,50,100,150,"50 / 100",4,14,169.56,"B"]
[3,50,105,155,"50 / 105",4,15,178.98,"B"]
[3,50,110,160,"50 / 110",4,16,188.4,"B"]
[3,50,115,165,"50 / 115",4,17,197.82,"B"]
[3,50,120,170,"50 / 120",4,18,207.24,"B"]
[3,50,125,175,"50 / 125",4,19,216.66,"B"]
[3,50,130,180,"50 / 130",4,20,226.07999999999998,"B"]
[3,50,135,185,"50 / 135",4,21,235.5,"B"]
[3,50,140,190,"50 / 140",4,22,244.92,"B"]
[3,50,145,195,"50 / 145",4,23,254.34,"B"]
[3,50,150,200,"50 / 150",4,24,263.76,"B"]
[3,50,155,205,"50 / 155",4,25,273.18,"B"]
[3,50,160,210,"50 / 160",4,26,282.60000000000002,"B"]
[3,50,165,215,"50 / 165",4,27,292.02,"B"]
[3,50,170,220,"50 / 170",4,28,301.44,"B"]
[3,50,175,225,"50 / 175",4,29,310.86,"B"]
[3,50,180,230,"50 / 180",4,30,320.27999999999997,"B"]
[3,50,185,235,"50 / 185",4,31,329.7,"B"]
[3,50,190,240,"50 / 190",4,32,339.12,"B"]
[3,50,195,245,"50 / 195",4,33,348.54,"B"]
[3,50,200,250,"50 / 200",4,34,357.96,"B"]
[3,55,30,85,"55 / 30",5,0,47.1,"B"]
[3,55,35,90,"55 / 35",5,1,56.519999999999996,"B"]
[3,55,40,95,"55 / 40",5,2,65.94,"B"]
[3,55,45,100,"55 / 45",5,3,75.36,"B"]
[3,55,50,105,"55 / 50",5,4,84.78,"B"]
[3,55,55,110,"55 / 55",5,5,94.2,"B"]
[3,55,60,115,"55 / 60",5,6,103.62,"B"]
[3,55,65,120,"55 / 65",5,7,113.03999999999999,"B"]
[3,55,70,125,"55 / 70",5,8,122.46,"B"]
[3,55,75,130,"55 / 75",5,9,131.88,"B"]
[3,55,80,135,"55 / 80",5,10,141.30000000000001,"B"]
[3,55,85,140,"55 / 85",5,11,150.72,"B"]
[3,55,90,145,"55 / 90",5,12,160.13999999999999,"B"]
[3,55,95,150,"55 / 95",5,13,169.56,"B"]
[3,55,100,155,"55 / 100",5,14,178.98,"B"]
[3,55,105,160,"55 / 105",5,15,188.4,"B"]
[3,55,110,165,"55 / 110",5,16,197.82,"B"]
[3,55,115,170,"55 / 115",5,17,207.24,"B"]
[3,55,120,{"$f":"B451+C451","v":175},{"$f":"CONCATENATE(B451,\" / \",C451)","v":"55 / 120"},5,18,216.66,"B"]
[3,55,125,180,"55 / 125",5,19,226.07999999999998,"B"]
[3,55,130,185,"55 / 130",5,20,235.5,"B"]
[3,55,135,190,"55 / 135",5,21,244.92,"B"]
[3,55,140,195,"55 / 140",5,22,254.34,"B"]
[3,55,145,200,"55 / 145",5,23,263.76,"B"]
[3,55,150,205,"55 / 150",5,24,273.18,"B"]
[3,55,155,210,"55 / 155",5,25,282.60000000000002,"B"]
[3,55,160,215,"55 / 160",5,26,292.02,"B"]
[3,55,165,220,"55 / 165",5,27,301.44,"B"]
[3,55,170,225,"55 / 170",5,28,310.86,"B"]
[3,55,175,230,"55 / 175",5,29,320.27999999999997,"B"]
[3,55,180,235,"55 / 180",5,30,329.7,"B"]
[3,55,185,240,"55 / 185",5,31,339.12,"B"]
[3,55,190,245,"55 / 190",5,32,348.54,"B"]
[3,55,195,250,"55 / 195",5,33,357.96,"B"]
[3,60,30,90,"60 / 30",6,0,56.519999999999996,"B"]
[3,60,35,95,"60 / 35",6,1,65.94,"B"]
[3,60,40,100,"60 / 40",6,2,75.36,"B"]
[3,60,45,105,"60 / 45",6,3,84.78,"B"]
[3,60,50,110,"60 / 50",6,4,{"$f":"(G471+F471)*N$5","v":94.2},"B"]
[3,60,55,115,"60 / 55",6,5,103.62,"B"]
[3,60,60,120,"60 / 60",6,6,113.03999999999999,"B"]
[3,60,65,125,"60 / 65",6,7,122.46,"B"]
[3,60,70,130,"60 / 70",6,8,131.88,"B"]
[3,60,75,135,"60 / 75",6,9,141.30000000000001,"B"]
[3,60,80,140,"60 / 80",6,10,150.72,"B"]
[3,60,85,145,"60 / 85",6,11,160.13999999999999,"B"]
[3,60,90,150,"60 / 90",6,12,169.56,"B"]
[3,60,95,155,"60 / 95",6,13,178.98,"B"]
[3,60,100,160,"60 / 100",6,14,188.4,"B"]
[3,60,105,165,"60 / 105",6,15,197.82,"B"]
[3,60,110,170,"60 / 110",6,16,207.24,"B"]
[3,60,115,175,"60 / 115",6,17,216.66,"B"]
[3,60,120,180,"60 / 120",6,18,226.07999999999998,"B"]
[3,60,125,185,"60 / 125",6,19,235.5,"B"]
[3,60,130,190,"60 / 130",6,20,244.92,"B"]
[3,60,135,195,"60 / 135",6,21,254.34,"B"]
[3,60,140,200,"60 / 140",6,22,263.76,"B"]
[3,60,145,205,"60 / 145",6,23,273.18,"B"]
[3,60,150,210,"60 / 150",6,24,282.60000000000002,"B"]
[3,60,155,215,"60 / 155",6,25,292.02,"B"]
[3,60,160,220,"60 / 160",6,26,301.44,"B"]
[3,60,165,225,"60 / 165",6,27,310.86,"B"]
[3,60,170,230,"60 / 170",6,28,320.27999999999997,"B"]
[3,60,175,235,"60 / 175",6,29,329.7,"B"]
[3,60,180,240,"60 / 180",6,30,339.12,"B"]
[3,60,185,245,"60 / 185",6,31,348.54,"B"]
[3,60,190,250,"60 / 190",6,32,357.96,"B"]
[3,65,30,95,"65 / 30",7,0,65.94,"B"]
[3,65,35,100,"65 / 35",7,1,75.36,"B"]
[3,65,40,105,"65 / 40",7,2,84.78,"B"]
[3,65,45,110,"65 / 45",7,3,94.2,"B"]
[3,65,50,115,"65 / 50",7,4,103.62,"B"]
[3,65,55,120,"65 / 55",7,5,113.03999999999999,"B"]
[3,65,60,125,"65 / 60",7,6,122.46,"B"]
[3,65,65,130,"65 / 65",7,7,131.88,"B"]
[3,65,70,135,"65 / 70",7,8,141.30000000000001,"B"]
[3,65,75,140,"65 / 75",7,9,150.72,"B"]
[3,65,80,145,"65 / 80",7,10,160.13999999999999,"B"]
[3,65,85,150,"65 / 85",7,11,169.56,"B"]
[3,65,90,155,"65 / 90",7,12,178.98,"B"]
[3,65,95,160,"65 / 95",7,13,188.4,"B"]
[3,65,100,165,"65 / 100",7,14,197.82,"B"]
[3,65,105,{"$f":"B515+C515","v":170},{"$f":"CONCATENATE(B515,\" / \",C515)","v":"65 / 105"},7,15,207.24,"B"]
[3,65,110,175,"65 / 110",7,16,216.66,"B"]
[3,65,115,180,"65 / 115",7,17,226.07999999999998,"B"]
[3,65,120,185,"65 / 120",7,18,235.5,"B"]
[3,65,125,190,"65 / 125",7,19,244.92,"B"]
[3,65,130,195,"65 / 130",7,20,254.34,"B"]
[3,65,135,200,"65 / 135",7,21,263.76,"B"]
[3,65,140,205,"65 / 140",7,22,273.18,"B"]
[3,65,145,210,"65 / 145",7,23,282.60000000000002,"B"]
[3,65,150,215,"65 / 150",7,24,292.02,"B"]
[3,65,155,220,"65 / 155",7,25,301.44,"B"]
[3,65,160,225,"65 / 160",7,26,310.86,"B"]
[3,65,165,230,"65 / 165",7,27,320.27999999999997,"B"]
[3,65,170,235,"65 / 170",7,28,329.7,"B"]
[3,65,175,240,"65 / 175",7,29,339.12,"B"]
[3,65,180,245,"65 / 180",7,30,348.54,"B"]
[3,65,185,250,"65 / 185",7,31,357.96,"B"]
[3,70,30,100,"70 / 30",8,0,75.36,"B"]
[3,70,35,105,"70 / 35",8,1,84.78,"B"]
[3,70,40,110,"70 / 40",8,2,94.2,"B"]
[3,70,45,115,"70 / 45",8,3,{"$f":"(G535+F535)*N$5","v":103.62},"B"]
[3,70,50,120,"70 / 50",8,4,113.03999999999999,"B"]
[3,70,55,125,"70 / 55",8,5,122.46,"B"]
[3,70,60,130,"70 / 60",8,6,131.88,"B"]
[3,70,65,135,"70 / 65",8,7,141.30000000000001,"B"]
[3,70,70,140,"70 / 70",8,8,150.72,"B"]
[3,70,75,145,"70 / 75",8,9,160.13999999999999,"B"]
[3,70,80,150,"70 / 80",8,10,169.56,"B"]
[3,70,85,155,"70 / 85",8,11,178.98,"B"]
[3,70,90,160,"70 / 90",8,12,188.4,"B"]
[3,70,95,165,"70 / 95",8,13,197.82,"B"]
[3,70,100,170,"70 / 100",8,14,207.24,"B"]
[3,70,105,175,"70 / 105",8,15,216.66,"B"]
[3,70,110,180,"70 / 110",8,16,226.07999999999998,"B"]
[3,70,115,185,"70 / 115",8,17,235.5,"B"]
[3,70,120,190,"70 / 120",8,18,244.92,"B"]
[3,70,125,195,"70 / 125",8,19,254.34,"B"]
[3,70,130,200,"70 / 130",8,20,263.76,"B"]
[3,70,135,205,"70 / 135",8,21,273.18,"B"]
[3,70,140,210,"70 / 140",8,22,282.60000000000002,"B"]
[3,70,145,215,"70 / 145",8,23,292.02,"B"]
[3,70,150,220,"70 / 150",8,24,301.44,"B"]
[3,70,155,225,"70 / 155",8,25,310.86,"B"]
[3,70,160,230,"70 / 160",8,26,320.27999999999997,"B"]
[3,70,165,235,"70 / 165",8,27,329.7,"B"]
[3,70,170,240,"70 / 170",8,28,339.12,"B"]
[3,70,175,245,"70 / 175",8,29,348.54,"B"]
[3,70,180,250,"70 / 180",8,30,357.96,"B"]
[3,75,30,105,"75 / 30",9,0,84.78,"B"]
[3,75,35,110,"75 / 35",9,1,94.2,"B"]
[3,75,40,115,"75 / 40",9,2,103.62,"B"]
[3,75,45,120,"75 / 45",9,3,113.03999999999999,"B"]
[3,75,50,125,"75 / 50",9,4,122.46,"B"]
[3,75,55,130,"75 / 55",9,5,131.88,"B"]
[3,75,60,135,"75 / 60",9,6,141.30000000000001,"B"]
[3,75,65,140,"75 / 65",9,7,150.72,"B"]
[3,75,70,145,"75 / 70",9,8,160.13999999999999,"B"]
[3,75,75,150,"75 / 75",9,9,169.56,"B"]
[3,75,80,155,"75 / 80",9,10,178.98,"B"]
[3,75,85,160,"75 / 85",9,11,188.4,"B"]
[3,75,90,165,"75 / 90",9,12,197.82,"B"]
[3,75,95,170,"75 / 95",9,13,207.24,"B"]
[3,75,100,175,"75 / 100",9,14,216.66,"B"]
[3,75,105,180,"75 / 105",9,15,226.07999999999998,"B"]
[3,75,110,{"$f":"B579+C579","v":185},{"$f":"CONCATENATE(B579,\" / \",C579)","v":"75 / 110"},9,16,235.5,"B"]
[3,75,115,190,"75 / 115",9,17,244.92,"B"]
[3,75,120,195,"75 / 120",9,18,254.34,"B"]
[3,75,125,200,"75 / 125",9,19,263.76,"B"]
[3,75,130,205,"75 / 130",9,20,273.18,"B"]
[3,75,135,210,"75 / 135",9,21,282.60000000000002,"B"]
[3,75,140,215,"75 / 140",9,22,292.02,"B"]
[3,75,145,220,"75 / 145",9,23,301.44,"B"]
[3,75,150,225,"75 / 150",9,24,310.86,"B"]
[3,75,155,230,"75 / 155",9,25,320.27999999999997,"B"]
[3,75,160,235,"75 / 160",9,26,329.7,"B"]
[3,75,165,240,"75 / 165",9,27,339.12,"B"]
[3,75,170,245,"75 / 170",9,28,348.54,"B"]
[3,75,175,250,"75 / 175",9,29,357.96,"B"]
[3,80,30,110,"80 / 30",10,0,94.2,"B"]
[3,80,35,115,"80 / 35",10,1,103.62,"B"]
[3,80,40,120,"80 / 40",10,2,113.03999999999999,"B"]
[3,80,45,125,"80 / 45",10,3,122.46,"B"]
[3,80,50,130,"80 / 50",10,4,131.88,"B"]
[3,80,55,135,"80 / 55",10,5,141.30000000000001,"B"]
[3,80,60,140,"80 / 60",10,6,{"$f":"(G599+F599)*N$5","v":150.72},"B"]
[3,80,65,145,"80 / 65",10,7,160.13999999999999,"B"]
[3,80,70,150,"80 / 70",10,8,169.56,"B"]
[3,80,75,155,"80 / 75",10,9,178.98,"B"]
[3,80,80,160,"80 / 80",10,10,188.4,"B"]
[3,80,85,165,"80 / 85",10,11,197.82,"B"]
[3,80,90,170,"80 / 90",10,12,207.24,"B"]
[3,80,95,175,"80 / 95",10,13,216.66,"B"]
[3,80,100,180,"80 / 100",10,14,226.07999999999998,"B"]
[3,80,105,185,"80 / 105",10,15,235.5,"B"]
[3,80,110,190,"80 / 110",10,16,244.92,"B"]
[3,80,115,195,"80 / 115",10,17,254.34,"B"]
[3,80,120,200,"80 / 120",10,18,263.76,"B"]
[3,80,125,205,"80 / 125",10,19,273.18,"B"]
[3,80,130,210,"80 / 130",10,20,282.60000000000002,"B"]
[3,80,135,215,"80 / 135",10,21,292.02,"B"]
[3,80,140,220,"80 / 140",10,22,301.44,"B"]
[3,80,145,225,"80 / 145",10,23,310.86,"B"]
[3,80,150,230,"80 / 150",10,24,320.27999999999997,"B"]
[3,80,155,235,"80 / 155",10,25,329.7,"B"]
[3,80,160,240,"80 / 160",10,26,339.12,"B"]
[3,80,165,245,"80 / 165",10,27,348.54,"B"]
[3,80,170,250,"80 / 170",10,28,357.96,"B"]
[3,85,30,115,"85 / 30",11,0,103.62,"B"]
[3,85,35,120,"85 / 35",11,1,113.03999999999999,"B"]
[3,85,40,125,"85 / 40",11,2,122.46,"B"]
[3,85,45,130,"85 / 45",11,3,131.88,"B"]
[3,85,50,135,"85 / 50",11,4,141.30000000000001,"B"]
[3,85,55,140,"85 / 55",11,5,150.72,"B"]
[3,85,60,145,"85 / 60",11,6,160.13999999999999,"B"]
[3,85,65,150,"85 / 65",11,7,169.56,"B"]
[3,85,70,155,"85 / 70",11,8,178.98,"B"]
[3,85,75,160,"85 / 75",11,9,188.4,"B"]
[3,85,80,165,"85 / 80",11,10,197.82,"B"]
[3,85,85,170,"85 / 85",11,11,207.24,"B"]
[3,85,90,175,"85 / 90",11,12,216.66,"B"]
[3,85,95,180,"85 / 95",11,13,226.07999999999998,"B"]
[3,85,100,185,"85 / 100",11,14,235.5,"B"]
[3,85,105,190,"85 / 105",11,15,244.92,"B"]
[3,85,110,195,"85 / 110",11,16,254.34,"B"]
[3,85,115,200,"85 / 115",11,17,263.76,"B"]
[3,85,120,205,"85 / 120",11,18,273.18,"B"]
[3,85,125,210,"85 / 125",11,19,282.60000000000002,"B"]
[3,85,130,215,"85 / 130",11,20,292.02,"B"]
[3,85,135,{"$f":"B643+C643","v":220},{"$f":"CONCATENATE(B643,\" / \",C643)","v":"85 / 135"},11,21,301.44,"B"]
[3,85,140,225,"85 / 140",11,22,310.86,"B"]
[3,85,145,230,"85 / 145",11,23,320.27999999999997,"B"]
[3,85,150,235,"85 / 150",11,24,329.7,"B"]
[3,85,155,240,"85 / 155",11,25,339.12,"B"]
[3,85,160,245,"85 / 160",11,26,348.54,"B"]
[3,85,165,250,"85 / 165",11,27,357.96,"B"]
[3,90,30,120,"90 / 30",12,0,113.03999999999999,"B"]
[3,90,35,125,"90 / 35",12,1,122.46,"B"]
[3,90,40,130,"90 / 40",12,2,131.88,"B"]
[3,90,45,135,"90 / 45",12,3,141.30000000000001,"B"]
[3,90,50,140,"90 / 50",12,4,150.72,"B"]
[3,90,55,145,"90 / 55",12,5,160.13999999999999,"B"]
[3,90,60,150,"90 / 60",12,6,169.56,"B"]
[3,90,65,155,"90 / 65",12,7,178.98,"B"]
[3,90,70,160,"90 / 70",12,8,188.4,"B"]
[3,90,75,165,"90 / 75",12,9,197.82,"B"]
[3,90,80,170,"90 / 80",12,10,207.24,"B"]
[3,90,85,175,"90 / 85",12,11,216.66,"B"]
[3,90,90,180,"90 / 90",12,12,226.07999999999998,"B"]
[3,90,95,185,"90 / 95",12,13,{"$f":"(G663+F663)*N$5","v":235.5},"B"]
[3,90,100,190,"90 / 100",12,14,244.92,"B"]
[3,90,105,195,"90 / 105",12,15,254.34,"B"]
[3,90,110,200,"90 / 110",12,16,263.76,"B"]
[3,90,115,205,"90 / 115",12,17,273.18,"B"]
[3,90,120,210,"90 / 120",12,18,282.60000000000002,"B"]
[3,90,125,215,"90 / 125",12,19,292.02,"B"]
[3,90,130,220,"90 / 130",12,20,301.44,"B"]
[3,90,135,225,"90 / 135",12,21,310.86,"B"]
[3,90,140,230,"90 / 140",12,22,320.27999999999997,"B"]
[3,90,145,235,"90 / 145",12,23,329.7,"B"]
[3,90,150,240,"90 / 150",12,24,339.12,"B"]
[3,90,155,245,"90 / 155",12,25,348.54,"B"]
[3,90,160,250,"90 / 160",12,26,357.96,"B"]
[3,95,30,125,"95 / 30",13,0,122.46,"B"]
[3,95,35,130,"95 / 35",13,1,131.88,"B"]
[3,95,40,135,"95 / 40",13,2,141.30000000000001,"B"]
[3,95,45,140,"95 / 45",13,3,150.72,"B"]
[3,95,50,145,"95 / 50",13,4,160.13999999999999,"B"]
[3,95,55,150,"95 / 55",13,5,169.56,"B"]
[3,95,60,155,"95 / 60",13,6,178.98,"B"]
[3,95,65,160,"95 / 65",13,7,188.4,"B"]
[3,95,70,165,"95 / 70",13,8,197.82,"B"]
[3,95,75,170,"95 / 75",13,9,207.24,"B"]
[3,95,80,175,"95 / 80",13,10,216.66,"B"]
[3,95,85,180,"95 / 85",13,11,226.07999999999998,"B"]
[3,95,90,185,"95 / 90",13,12,235.5,"B"]
[3,95,95,190,"95 / 95",13,13,244.92,"B"]
[3,95,100,195,"95 / 100",13,14,254.34,"B"]
[3,95,105,200,"95 / 105",13,15,263.76,"B"]
[3,95,110,205,"95 / 110",13,16,273.18,"B"]
[3,95,115,210,"95 / 115",13,17,282.60000000000002,"B"]
[3,95,120,215,"95 / 120",13,18,292.02,"B"]
[3,95,125,220,"95 / 125",13,19,301.44,"B"]
[3,95,130,225,"95 / 130",13,20,310.86,"B"]
[3,95,135,230,"95 / 135",13,21,320.27999999999997,"B"]
[3,95,140,235,"95 / 140",13,22,329.7,"B"]
[3,95,145,240,"95 / 145",13,23,339.12,"B"]
[3,95,150,245,"95 / 150",13,24,348.54,"B"]
[3,95,155,250,"95 / 155",13,25,357.96,"B"]
[3,100,30,130,"100 / 30",14,0,131.88,"B"]
[3,100,35,135,"100 / 35",14,1,141.30000000000001,"B"]
[3,100,40,140,"100 / 40",14,2,150.72,"B"]
[3,100,45,145,"100 / 45",14,3,160.13999999999999,"B"]
[3,100,50,{"$f":"B707+C707","v":150},{"$f":"CONCATENATE(B707,\" / \",C707)","v":"100 / 50"},14,4,169.56,"B"]
[3,100,55,155,"100 / 55",14,5,178.98,"B"]
[3,100,60,160,"100 / 60",14,6,188.4,"B"]
[3,100,65,165,"100 / 65",14,7,197.82,"B"]
[3,100,70,170,"100 / 70",14,8,207.24,"B"]
[3,100,75,175,"100 / 75",14,9,216.66,"B"]
[3,100,80,180,"100 / 80",14,10,226.07999999999998,"B"]
[3,100,85,185,"100 / 85",14,11,235.5,"B"]
[3,100,90,190,"100 / 90",14,12,244.92,"B"]
[3,100,95,195,"100 / 95",14,13,254.34,"B"]
[3,100,100,200,"100 / 100",14,14,263.76,"B"]
[3,100,105,205,"100 / 105",14,15,273.18,"B"]
[3,100,110,210,"100 / 110",14,16,282.60000000000002,"B"]
[3,100,115,215,"100 / 115",14,17,292.02,"B"]
[3,100,120,220,"100 / 120",14,18,301.44,"B"]
[3,100,125,225,"100 / 125",14,19,310.86,"B"]
[3,100,130,230,"100 / 130",14,20,320.27999999999997,"B"]
[3,100,135,235,"100 / 135",14,21,329.7,"B"]
[3,100,140,240,"100 / 140",14,22,339.12,"B"]
[3,100,145,245,"100 / 145",14,23,348.54,"B"]
[3,100,150,250,"100 / 150",14,24,{"$f":"(G727+F727)*N$5","v":357.96},"B"]
[3,105,30,135,"105 / 30",15,0,{"$f":"(G728+F728)*N$5","v":141.30000000000001},"B"]
[3,105,35,140,"105 / 35",15,1,150.72,"B"]
[3,105,40,145,"105 / 40",15,2,160.13999999999999,"B"]
[3,105,45,150,"105 / 45",15,3,169.56,"B"]
[3,105,50,155,"105 / 50",15,4,178.98,"B"]
[3,105,55,160,"105 / 55",15,5,188.4,"B"]
[3,105,60,165,"105 / 60",15,6,197.82,"B"]
[3,105,65,170,"105 / 65",15,7,207.24,"B"]
[3,105,70,175,"105 / 70",15,8,216.66,"B"]
[3,105,75,180,"105 / 75",15,9,226.07999999999998,"B"]
[3,105,80,185,"105 / 80",15,10,235.5,"B"]
[3,105,85,190,"105 / 85",15,11,244.92,"B"]
[3,105,90,195,"105 / 90",15,12,254.34,"B"]
[3,105,95,200,"105 / 95",15,13,263.76,"B"]
[3,105,100,205,"105 / 100",15,14,273.18,"B"]
[3,105,105,210,"105 / 105",15,15,282.60000000000002,"B"]
[3,105,110,215,"105 / 110",15,16,292.02,"B"]
[3,105,115,220,"105 / 115",15,17,301.44,"B"]
[3,105,120,225,"105 / 120",15,18,310.86,"B"]
[3,105,125,230,"105 / 125",15,19,320.27999999999997,"B"]
[3,105,130,235,"105 / 130",15,20,329.7,"B"]
[3,105,135,240,"105 / 135",15,21,339.12,"B"]
[3,105,140,245,"105 / 140",15,22,348.54,"B"]
[3,105,145,250,"105 / 145",15,23,357.96,"B"]
[3,110,30,140,"110 / 30",16,0,150.72,"B"]
[3,110,35,145,"110 / 35",16,1,160.13999999999999,"B"]
[3,110,40,150,"110 / 40",16,2,169.56,"B"]
[3,110,45,155,"110 / 45",16,3,178.98,"B"]
[3,110,50,160,"110 / 50",16,4,188.4,"B"]
[3,110,55,165,"110 / 55",16,5,197.82,"B"]
[3,110,60,170,"110 / 60",16,6,207.24,"B"]
[3,110,65,175,"110 / 65",16,7,216.66,"B"]
[3,110,70,180,"110 / 70",16,8,226.07999999999998,"B"]
[3,110,75,185,"110 / 75",16,9,235.5,"B"]
[3,110,80,190,"110 / 80",16,10,244.92,"B"]
[3,110,85,195,"110 / 85",16,11,254.34,"B"]
[3,110,90,200,"110 / 90",16,12,263.76,"B"]
[3,110,95,205,"110 / 95",16,13,273.18,"B"]
[3,110,100,210,"110 / 100",16,14,282.60000000000002,"B"]
[3,110,105,215,"110 / 105",16,15,292.02,"B"]
[3,110,110,220,"110 / 110",16,16,301.44,"B"]
[3,110,115,225,"110 / 115",16,17,310.86,"B"]
[3,110,120,230,"110 / 120",16,18,320.27999999999997,"B"]
[3,110,125,{"$f":"B771+C771","v":235},{"$f":"CONCATENATE(B771,\" / \",C771)","v":"110 / 125"},16,19,329.7,"B"]
[3,110,130,240,"110 / 130",16,20,339.12,"B"]
[3,110,135,245,"110 / 135",16,21,348.54,"B"]
[3,110,140,250,"110 / 140",16,22,357.96,"B"]
[3,115,30,145,"115 / 30",17,0,160.13999999999999,"B"]
[3,115,35,150,"115 / 35",17,1,169.56,"B"]
[3,115,40,155,"115 / 40",17,2,178.98,"B"]
[3,115,45,160,"115 / 45",17,3,188.4,"B"]
[3,115,50,165,"115 / 50",17,4,197.82,"B"]
[3,115,55,170,"115 / 55",17,5,207.24,"B"]
[3,115,60,175,"115 / 60",17,6,216.66,"B"]
[3,115,65,180,"115 / 65",17,7,226.07999999999998,"B"]
[3,115,70,185,"115 / 70",17,8,235.5,"B"]
[3,115,75,190,"115 / 75",17,9,244.92,"B"]
[3,115,80,195,"115 / 80",17,10,254.34,"B"]
[3,115,85,200,"115 / 85",17,11,263.76,"B"]
[3,115,90,205,"115 / 90",17,12,273.18,"B"]
[3,115,95,210,"115 / 95",17,13,282.60000000000002,"B"]
[3,115,100,215,"115 / 100",17,14,292.02,"B"]
[3,115,105,220,"115 / 105",17,15,301.44,"B"]
[3,115,110,225,"115 / 110",17,16,{"$f":"(G791+F791)*N$5","v":310.86},"B"]
[3,115,115,230,"115 / 115",17,17,320.27999999999997,"B"]
[3,115,120,235,"115 / 120",17,18,329.7,"B"]
[3,115,125,240,"115 / 125",17,19,339.12,"B"]
[3,115,130,245,"115 / 130",17,20,348.54,"B"]
[3,115,135,250,"115 / 135",17,21,357.96,"B"]
[3,120,30,150,"120 / 30",18,0,169.56,"B"]
[3,120,35,155,"120 / 35",18,1,178.98,"B"]
[3,120,40,160,"120 / 40",18,2,188.4,"B"]
[3,120,45,165,"120 / 45",18,3,197.82,"B"]
[3,120,50,170,"120 / 50",18,4,207.24,"B"]
[3,120,55,175,"120 / 55",18,5,216.66,"B"]
[3,120,60,180,"120 / 60",18,6,226.07999999999998,"B"]
[3,120,65,185,"120 / 65",18,7,235.5,"B"]
[3,120,70,190,"120 / 70",18,8,244.92,"B"]
[3,120,75,195,"120 / 75",18,9,254.34,"B"]
[3,120,80,200,"120 / 80",18,10,263.76,"B"]
[3,120,85,205,"120 / 85",18,11,273.18,"B"]
[3,120,90,210,"120 / 90",18,12,282.60000000000002,"B"]
[3,120,95,215,"120 / 95",18,13,292.02,"B"]
[3,120,100,220,"120 / 100",18,14,301.44,"B"]
[3,120,105,225,"120 / 105",18,15,310.86,"B"]
[3,120,110,230,"120 / 110",18,16,320.27999999999997,"B"]
[3,120,115,235,"120 / 115",18,17,329.7,"B"]
[3,120,120,240,"120 / 120",18,18,339.12,"B"]
[3,120,125,245,"120 / 125",18,19,348.54,"B"]
[3,120,130,250,"120 / 130",18,20,357.96,"B"]
[3,125,30,155,"125 / 30",19,0,178.98,"B"]
[3,125,35,160,"125 / 35",19,1,188.4,"B"]
[3,125,40,165,"125 / 40",19,2,197.82,"B"]
[3,125,45,170,"125 / 45",19,3,207.24,"B"]
[3,125,50,175,"125 / 50",19,4,216.66,"B"]
[3,125,55,180,"125 / 55",19,5,226.07999999999998,"B"]
[3,125,60,185,"125 / 60",19,6,235.5,"B"]
[3,125,65,190,"125 / 65",19,7,244.92,"B"]
[3,125,70,195,"125 / 70",19,8,254.34,"B"]
[3,125,75,200,"125 / 75",19,9,263.76,"B"]
[3,125,80,205,"125 / 80",19,10,273.18,"B"]
[3,125,85,210,"125 / 85",19,11,282.60000000000002,"B"]
[3,125,90,215,"125 / 90",19,12,292.02,"B"]
[3,125,95,220,"125 / 95",19,13,301.44,"B"]
[3,125,100,225,"125 / 100",19,14,310.86,"B"]
[3,125,105,230,"125 / 105",19,15,320.27999999999997,"B"]
[3,125,110,235,"125 / 110",19,16,329.7,"B"]
[3,125,115,{"$f":"B835+C835","v":240},{"$f":"CONCATENATE(B835,\" / \",C835)","v":"125 / 115"},19,17,339.12,"B"]
[3,125,120,245,"125 / 120",19,18,348.54,"B"]
[3,125,125,250,"125 / 125",19,19,357.96,"B"]
[3,130,30,160,"130 / 30",20,0,188.4,"B"]
[3,130,35,165,"130 / 35",20,1,197.82,"B"]
[3,130,40,170,"130 / 40",20,2,207.24,"B"]
[3,130,45,175,"130 / 45",20,3,216.66,"B"]
[3,130,50,180,"130 / 50",20,4,226.07999999999998,"B"]
[3,130,55,185,"130 / 55",20,5,235.5,"B"]
[3,130,60,190,"130 / 60",20,6,244.92,"B"]
[3,130,65,195,"130 / 65",20,7,254.34,"B"]
[3,130,70,200,"130 / 70",20,8,263.76,"B"]
[3,130,75,205,"130 / 75",20,9,273.18,"B"]
[3,130,80,210,"130 / 80",20,10,282.60000000000002,"B"]
[3,130,85,215,"130 / 85",20,11,292.02,"B"]
[3,130,90,220,"130 / 90",20,12,301.44,"B"]
[3,130,95,225,"130 / 95",20,13,310.86,"B"]
[3,130,100,230,"130 / 100",20,14,320.27999999999997,"B"]
[3,130,105,235,"130 / 105",20,15,329.7,"B"]
[3,130,110,240,"130 / 110",20,16,339.12,"B"]
[3,130,115,245,"130 / 115",20,17,{"$f":"(G855+F855)*N$5","v":348.54},"B"]
[3,130,120,250,"130 / 120",20,18,357.96,"B"]
[3,135,30,165,"135 / 30",21,0,197.82,"B"]
[3,135,35,170,"135 / 35",21,1,207.24,"B"]
[3,135,40,175,"135 / 40",21,2,216.66,"B"]
[3,135,45,180,"135 / 45",21,3,226.07999999999998,"B"]
[3,135,50,185,"135 / 50",21,4,235.5,"B"]
[3,135,55,190,"135 / 55",21,5,244.92,"B"]
[3,135,60,195,"135 / 60",21,6,254.34,"B"]
[3,135,65,200,"135 / 65",21,7,263.76,"B"]
[3,135,70,205,"135 / 70",21,8,273.18,"B"]
[3,135,75,210,"135 / 75",21,9,282.60000000000002,"B"]
[3,135,80,215,"135 / 80",21,10,292.02,"B"]
[3,135,85,220,"135 / 85",21,11,301.44,"B"]
[3,135,90,225,"135 / 90",21,12,310.86,"B"]
[3,135,95,230,"135 / 95",21,13,320.27999999999997,"B"]
[3,135,100,235,"135 / 100",21,14,329.7,"B"]
[3,135,105,240,"135 / 105",21,15,339.12,"B"]
[3,135,110,245,"135 / 110",21,16,348.54,"B"]
[3,135,115,250,"135 / 115",21,17,357.96,"B"]
[3,140,30,170,"140 / 30",22,0,207.24,"B"]
[3,140,35,175,"140 / 35",22,1,216.66,"B"]
[3,140,40,180,"140 / 40",22,2,226.07999999999998,"B"]
[3,140,45,185,"140 / 45",22,3,235.5,"B"]
[3,140,50,190,"140 / 50",22,4,244.92,"B"]
[3,140,55,195,"140 / 55",22,5,254.34,"B"]
[3,140,60,200,"140 / 60",22,6,263.76,"B"]
[3,140,65,205,"140 / 65",22,7,273.18,"B"]
[3,140,70,210,"140 / 70",22,8,282.60000000000002,"B"]
[3,140,75,215,"140 / 75",22,9,292.02,"B"]
[3,140,80,220,"140 / 80",22,10,301.44,"B"]
[3,140,85,225,"140 / 85",22,11,310.86,"B"]
[3,140,90,230,"140 / 90",22,12,320.27999999999997,"B"]
[3,140,95,235,"140 / 95",22,13,329.7,"B"]
[3,140,100,240,"140 / 100",22,14,339.12,"B"]
[3,140,105,245,"140 / 105",22,15,348.54,"B"]
[3,140,110,250,"140 / 110",22,16,357.96,"B"]
[3,145,30,175,"145 / 30",23,0,216.66,"B"]
[3,145,35,180,"145 / 35",23,1,226.07999999999998,"B"]
[3,145,40,185,"145 / 40",23,2,235.5,"B"]
[3,145,45,190,"145 / 45",23,3,244.92,"B"]
[3,145,50,195,"145 / 50",23,4,254.34,"B"]
[3,145,55,200,"145 / 55",23,5,263.76,"B"]
[3,145,60,205,"145 / 60",23,6,273.18,"B"]
[3,145,65,{"$f":"B899+C899","v":210},{"$f":"CONCATENATE(B899,\" / \",C899)","v":"145 / 65"},23,7,282.60000000000002,"B"]
[3,145,70,215,"145 / 70",23,8,292.02,"B"]
[3,145,75,220,"145 / 75",23,9,301.44,"B"]
[3,145,80,225,"145 / 80",23,10,310.86,"B"]
[3,145,85,230,"145 / 85",23,11,320.27999999999997,"B"]
[3,145,90,235,"145 / 90",23,12,329.7,"B"]
[3,145,95,240,"145 / 95",23,13,339.12,"B"]
[3,145,100,245,"145 / 100",23,14,348.54,"B"]
[3,145,105,250,"145 / 105",23,15,357.96,"B"]
[3,150,30,180,"150 / 30",24,0,226.07999999999998,"B"]
[3,150,35,185,"150 / 35",24,1,235.5,"B"]
[3,150,40,190,"150 / 40",24,2,244.92,"B"]
[3,150,45,195,"150 / 45",24,3,254.34,"B"]
[3,150,50,200,"150 / 50",24,4,263.76,"B"]
[3,150,55,205,"150 / 55",24,5,273.18,"B"]
[3,150,60,210,"150 / 60",24,6,282.60000000000002,"B"]
[3,150,65,215,"150 / 65",24,7,292.02,"B"]
[3,150,70,220,"150 / 70",24,8,301.44,"B"]
[3,150,75,225,"150 / 75",24,9,310.86,"B"]
[3,150,80,230,"150 / 80",24,10,320.27999999999997,"B"]
[3,150,85,235,"150 / 85",24,11,{"$f":"(G919+F919)*N$5","v":329.7},"B"]
[3,150,90,240,"150 / 90",24,12,339.12,"B"]
[3,150,95,245,"150 / 95",24,13,348.54,"B"]
[3,150,100,250,"150 / 100",24,14,357.96,"B"]
[3,155,30,185,"155 / 30",25,0,235.5,"B"]
[3,155,35,190,"155 / 35",25,1,244.92,"B"]
[3,155,40,195,"155 / 40",25,2,254.34,"B"]
[3,155,45,200,"155 / 45",25,3,263.76,"B"]
[3,155,50,205,"155 / 50",25,4,273.18,"B"]
[3,155,55,210,"155 / 55",25,5,282.60000000000002,"B"]
[3,155,60,215,"155 / 60",25,6,292.02,"B"]
[3,155,65,220,"155 / 65",25,7,301.44,"B"]
[3,155,70,225,"155 / 70",25,8,310.86,"B"]
[3,155,75,230,"155 / 75",25,9,320.27999999999997,"B"]
[3,155,80,235,"155 / 80",25,10,329.7,"B"]
[3,155,85,240,"155 / 85",25,11,339.12,"B"]
[3,155,90,245,"155 / 90",25,12,348.54,"B"]
[3,155,95,250,"155 / 95",25,13,357.96,"B"]
[3,160,30,190,"160 / 30",26,0,244.92,"B"]
[3,160,35,195,"160 / 35",26,1,254.34,"B"]
[3,160,40,200,"160 / 40",26,2,263.76,"B"]
[3,160,45,205,"160 / 45",26,3,273.18,"B"]
[3,160,50,210,"160 / 50",26,4,282.60000000000002,"B"]
[3,160,55,215,"160 / 55",26,5,292.02,"B"]
[3,160,60,220,"160 / 60",26,6,301.44,"B"]
[3,160,65,225,"160 / 65",26,7,310.86,"B"]
[3,160,70,230,"160 / 70",26,8,320.27999999999997,"B"]
[3,160,75,235,"160 / 75",26,9,329.7,"B"]
[3,160,80,240,"160 / 80",26,10,339.12,"B"]
[3,160,85,245,"160 / 85",26,11,348.54,"B"]
[3,160,90,250,"160 / 90",26,12,357.96,"B"]
[3,165,30,195,"165 / 30",27,0,254.34,"B"]
[3,165,35,200,"165 / 35",27,1,263.76,"B"]
[3,165,40,205,"165 / 40",27,2,273.18,"B"]
[3,165,45,210,"165 / 45",27,3,282.60000000000002,"B"]
[3,165,50,215,"165 / 50",27,4,292.02,"B"]
[3,165,55,220,"165 / 55",27,5,301.44,"B"]
[3,165,60,225,"165 / 60",27,6,310.86,"B"]
[3,165,65,230,"165 / 65",27,7,320.27999999999997,"B"]
[3,165,70,235,"165 / 70",27,8,329.7,"B"]
[3,165,75,240,"165 / 75",27,9,339.12,"B"]
[3,165,80,245,"165 / 80",27,10,348.54,"B"]
[3,165,85,250,"165 / 85",27,11,357.96,"B"]
[3,170,30,200,"170 / 30",28,0,263.76,"B"]
[3,170,35,{"$f":"B963+C963","v":205},{"$f":"CONCATENATE(B963,\" / \",C963)","v":"170 / 35"},28,1,273.18,"B"]
[3,170,40,210,"170 / 40",28,2,282.60000000000002,"B"]
[3,170,45,215,"170 / 45",28,3,292.02,"B"]
[3,170,50,220,"170 / 50",28,4,301.44,"B"]
[3,170,55,225,"170 / 55",28,5,310.86,"B"]
[3,170,60,230,"170 / 60",28,6,320.27999999999997,"B"]
[3,170,65,235,"170 / 65",28,7,329.7,"B"]
[3,170,70,240,"170 / 70",28,8,339.12,"B"]
[3,170,75,245,"170 / 75",28,9,348.54,"B"]
[3,170,80,250,"170 / 80",28,10,357.96,"B"]
[3,175,30,205,"175 / 30",29,0,273.18,"B"]
[3,175,35,210,"175 / 35",29,1,282.60000000000002,"B"]
[3,175,40,215,"175 / 40",29,2,292.02,"B"]
[3,175,45,220,"175 / 45",29,3,301.44,"B"]
[3,175,50,225,"175 / 50",29,4,310.86,"B"]
[3,175,55,230,"175 / 55",29,5,320.27999999999997,"B"]
[3,175,60,235,"175 / 60",29,6,329.7,"B"]
[3,175,65,240,"175 / 65",29,7,339.12,"B"]
[3,175,70,245,"175 / 70",29,8,348.54,"B"]
[3,175,75,250,"175 / 75",29,9,357.96,"B"]
[3,180,30,210,"180 / 30",30,0,{"$f":"(G983+F983)*N$5","v":282.60000000000002},"B"]
[3,180,35,215,"180 / 35",30,1,292.02,"B"]
[3,180,40,220,"180 / 40",30,2,301.44,"B"]
[3,180,45,225,"180 / 45",30,3,310.86,"B"]
[3,180,50,230,"180 / 50",30,4,320.27999999999997,"B"]
[3,180,55,235,"180 / 55",30,5,329.7,"B"]
[3,180,60,240,"180 / 60",30,6,339.12,"B"]
[3,180,65,245,"180 / 65",30,7,348.54,"B"]
[3,180,70,250,"180 / 70",30,8,357.96,"B"]
[3,185,30,215,"185 / 30",31,0,292.02,"B"]
[3,185,35,220,"185 / 35",31,1,301.44,"B"]
[3,185,40,225,"185 / 40",31,2,310.86,"B"]
[3,185,45,230,"185 / 45",31,3,320.27999999999997,"B"]
[3,185,50,235,"185 / 50",31,4,329.7,"B"]
[3,185,55,240,"185 / 55",31,5,339.12,"B"]
[3,185,60,245,"185 / 60",31,6,348.54,"B"]
[3,185,65,250,"185 / 65",31,7,357.96,"B"]
[3,190,30,220,"190 / 30",32,0,301.44,"B"]
[3,190,35,225,"190 / 35",32,1,310.86,"B"]
[3,190,40,230,"190 / 40",32,2,320.27999999999997,"B"]
[3,190,45,235,"190 / 45",32,3,329.7,"B"]
[3,190,50,240,"190 / 50",32,4,339.12,"B"]
[3,190,55,245,"190 / 55",32,5,348.54,"B"]
[3,190,60,250,"190 / 60",32,6,357.96,"B"]
[3,195,30,225,"195 / 30",33,0,310.86,"B"]
[3,195,35,230,"195 / 35",33,1,320.27999999999997,"B"]
[3,195,40,235,"195 / 40",33,2,329.7,"B"]
[3,195,45,240,"195 / 45",33,3,339.12,"B"]
[3,195,50,245,"195 / 50",33,4,348.54,"B"]
[3,195,55,250,"195 / 55",33,5,357.96,"B"]
[3,200,30,230,"200 / 30",34,0,320.27999999999997,"B"]
[3,200,35,235,"200 / 35",34,1,329.7,"B"]
[3,200,40,240,"200 / 40",34,2,339.12,"B"]
[3,200,45,245,"200 / 45",34,3,348.54,"B"]
[3,200,50,250,"200 / 50",34,4,357.96,"B"]
[3,210,30,240,"210 / 30",36,0,339.12,"B"]
[3,210,35,245,"210 / 35",36,1,348.54,"B"]
[3,210,40,250,"210 / 40",36,2,357.96,"B"]
[4,30,0,30,"30 / 0",0,null,{"$f":"(G1021+F1021)*N$3","v":0},"B"]
[4,35,0,35,"35 / 0",1,null,5.86,"B"]
[4,40,0,40,"40 / 0",2,null,11.72,"B"]
[4,45,0,45,"45 / 0",3,null,17.580000000000002,"B"]
[4,50,0,50,"50 / 0",4,null,23.44,"B"]
[4,55,0,55,"55 / 0",5,null,29.3,"B"]
[4,60,0,{"$f":"B1027+C1027","v":60},{"$f":"CONCATENATE(B1027,\" / \",C1027)","v":"60 / 0"},6,null,35.160000000000004,"B"]
[4,65,0,65,"65 / 0",7,null,41.02,"B"]
[4,70,0,70,"70 / 0",8,null,46.88,"B"]
[5,27,35,62,"27 / 35",null,1,0,"B"]
[5,27,40,67,"27 / 40",null,2,11.36,"B"]
[6,27,27,54,"27 / 27",0,null,0,"B"]
[10,32,0,32,"32 / 0",null,0,{"$f":"(G1033+F1033)*N$5","v":0},"B"]
[10,37,0,37,"37 / 0",null,1,9.42,"B"]
[10,42,0,42,"42 / 0",null,1,9.42,"B"]
[10,47,0,47,"47 / 0",null,2,18.84,"B"]
[10,52,0,52,"52 / 0",null,2,18.84,"B"]
[10,57,0,57,"57 / 0",null,3,28.259999999999998,"B"]
[10,57,0,57,"57 / 0",null,3,28.259999999999998,"B"]
[10,62,0,62,"62 / 0",null,3,28.259999999999998,"B"]
[10,72,0,72,"72 / 0",null,4,37.68,"B"]
[10,77,0,77,"77 / 0",null,5,47.1,"B"]
[10,82,0,82,"82 / 0",null,5,47.1,"B"]
[10,87,0,87,"87 / 0",null,6,56.519999999999996,"B"]
[10,92,0,92,"92 / 0",null,6,56.519999999999996,"B"]
[10,97,0,97,"97 / 0",null,7,65.94,"B"]
[10,102,0,102,"102 / 0",null,7,65.94,"B"]
[17,30,0,30,"30 / 0",null,0,0,"B"]
[17,35,0,35,"35 / 0",null,1,9.42,"B"]
[17,40,0,40,"40 / 0",null,2,18.84,"B"]
[17,45,0,45,"45 / 0",null,3,28.259999999999998,"B"]
[17,50,0,50,"50 / 0",null,4,37.68,"B"]
[17,55,0,55,"55 / 0",null,5,47.1,"B"]
[17,60,0,60,"60 / 0",null,6,56.519999999999996,"B"]
[17,65,0,65,"65 / 0",null,7,65.94,"B"]
[17,70,0,70,"70 / 0",null,8,75.36,"B"]
[17,75,0,75,"75 / 0",null,9,84.78,"B"]
[17,80,0,80,"80 / 0",null,10,94.2,"B"]
[17,85,0,85,"85 / 0",null,11,103.62,"B"]
[17,90,0,90,"90 / 0",null,12,113.03999999999999,"B"]
[17,95,0,95,"95 / 0",null,13,122.46,"B"]
[17,100,0,100,"100 / 0",null,14,131.88,"B"]
[17,105,0,105,"105 / 0",null,15,141.30000000000001,"B"]
[17,110,0,110,"110 / 0",null,16,150.72,"B"]
[17,115,0,115,"115 / 0",null,17,160.13999999999999,"B"]
[17,120,0,120,"120 / 0",null,18,169.56,"B"]
[17,125,0,125,"125 / 0",null,19,178.98,"B"]
[17,130,0,130,"130 / 0",null,20,188.4,"B"]
[18,32,32,64,"32 / 32",0,0,0,"B"]
[18,32,37,69,"32 / 37",0,1,9.42,"B"]
[18,32,42,74,"32 / 42",0,2,18.84,"B"]
[18,32,47,79,"32 / 47",0,3,28.259999999999998,"B"]
[18,32,52,84,"32 / 52",0,4,37.68,"B"]
[18,32,57,89,"32 / 57",0,5,47.1,"B"]
[18,32,62,94,"32 / 62",0,6,56.519999999999996,"B"]
[18,32,67,99,"32 / 67",0,7,65.94,"B"]
[18,32,72,104,"32 / 72",0,8,75.36,"B"]
[18,32,82,114,"32 / 82",0,10,94.2,"B"]
[18,32,92,124,"32 / 92",0,12,113.03999999999999,"B"]
[18,32,102,134,"32 / 102",0,14,131.88,"B"]
[18,32,112,144,"32 / 112",0,16,150.72,"B"]
[18,32,122,154,"32 / 122",0,18,169.56,"B"]
[18,32,132,164,"32 / 132",0,20,188.4,"B"]
[18,37,32,69,"37 / 32",1,0,9.42,"B"]
[18,37,37,74,"37 / 37",1,1,18.84,"B"]
[18,37,42,79,"37 / 42",1,2,28.259999999999998,"B"]
[18,37,47,84,"37 / 47",1,3,37.68,"B"]
[18,37,52,89,"37 / 52",1,4,47.1,"B"]
[18,37,57,94,"37 / 57",1,5,56.519999999999996,"B"]
[18,37,62,99,"37 / 62",1,6,65.94,"B"]
[18,37,67,{"$f":"B1091+C1091","v":104},{"$f":"CONCATENATE(B1091,\" / \",C1091)","v":"37 / 67"},1,7,75.36,"B"]
[18,42,32,74,"42 / 32",2,0,18.84,"B"]
[18,42,37,79,"42 / 37",2,1,28.259999999999998,"B"]
[18,42,42,84,"42 / 42",2,2,37.68,"B"]
[18,42,47,89,"42 / 47",2,3,47.1,"B"]
[18,42,52,94,"42 / 52",2,4,56.519999999999996,"B"]
[18,42,57,99,"42 / 57",2,5,{"$f":"(G1097+F1097)*N$5","v":65.94},"B"]
[18,42,62,104,"42 / 62",2,6,75.36,"B"]
[18,42,67,109,"42 / 67",2,7,84.78,"B"]
[18,42,72,114,"42 / 72",2,8,94.2,"B"]
[18,42,82,124,"42 / 82",2,10,113.03999999999999,"B"]
[18,42,92,134,"42 / 92",2,12,131.88,"B"]
[18,42,102,144,"42 / 102",2,14,150.72,"B"]
[18,42,112,154,"42 / 112",2,16,169.56,"B"]
[18,42,122,164,"42 / 122",2,18,188.4,"B"]
[18,42,132,174,"42 / 132",2,20,207.24,"B"]
[18,47,32,79,"47 / 32",3,0,28.259999999999998,"B"]
[18,47,37,84,"47 / 37",3,1,37.68,"B"]
[18,47,42,89,"47 / 42",3,2,47.1,"B"]
[18,47,47,94,"47 / 47",3,3,56.519999999999996,"B"]
[18,47,52,99,"47 / 52",3,4,65.94,"B"]
[18,47,57,104,"47 / 57",3,5,75.36,"B"]
[18,47,62,109,"47 / 62",3,6,84.78,"B"]
[18,47,67,114,"47 / 67",3,7,94.2,"B"]
[18,52,32,84,"52 / 32",4,0,37.68,"B"]
[18,52,37,89,"52 / 37",4,1,47.1,"B"]
[18,52,42,94,"52 / 42",4,2,56.519999999999996,"B"]
[18,52,47,99,"52 / 47",4,3,65.94,"B"]
[18,52,52,104,"52 / 52",4,4,75.36,"B"]
[18,52,57,109,"52 / 57",4,5,84.78,"B"]
[18,52,62,114,"52 / 62",4,6,94.2,"B"]
[18,52,67,119,"52 / 67",4,7,103.62,"B"]
[18,52,72,124,"52 / 72",4,8,113.03999999999999,"B"]
[18,52,82,134,"52 / 82",4,10,131.88,"B"]
[18,52,92,144,"52 / 92",4,12,150.72,"B"]
[18,52,102,154,"52 / 102",4,14,169.56,"B"]
[18,52,112,164,"52 / 112",4,16,188.4,"B"]
[18,52,122,174,"52 / 122",4,18,207.24,"B"]
[18,52,132,184,"52 / 132",4,20,226.07999999999998,"B"]
[18,57,32,89,"57 / 32",5,0,47.1,"B"]
[18,57,37,94,"57 / 37",5,1,56.519999999999996,"B"]
[18,57,42,99,"57 / 42",5,2,65.94,"B"]
[18,57,47,104,"57 / 47",5,3,75.36,"B"]
[18,57,52,109,"57 / 52",5,4,84.78,"B"]
[18,57,57,114,"57 / 57",5,5,94.2,"B"]
[18,57,62,119,"57 / 62",5,6,103.62,"B"]
[18,57,67,124,"57 / 67",5,7,113.03999999999999,"B"]
[18,62,32,94,"62 / 32",6,0,56.519999999999996,"B"]
[18,62,37,99,"62 / 37",6,1,65.94,"B"]
[18,62,42,104,"62 / 42",6,2,75.36,"B"]
[18,62,47,109,"62 / 47",6,3,84.78,"B"]
[18,62,52,114,"62 / 52",6,4,94.2,"B"]
[18,62,57,119,"62 / 57",6,5,103.62,"B"]
[18,62,62,124,"62 / 62",6,6,113.03999999999999,"B"]
[18,62,67,129,"62 / 67",6,7,122.46,"B"]
[18,62,72,134,"62 / 72",6,8,131.88,"B"]
[18,62,82,144,"62 / 82",6,10,150.72,"B"]
[18,62,92,154,"62 / 92",6,12,169.56,"B"]
[18,62,102,164,"62 / 102",6,14,188.4,"B"]
[18,62,112,174,"62 / 112",6,16,207.24,"B"]
[18,62,122,184,"62 / 122",6,18,226.07999999999998,"B"]
[18,62,132,194,"62 / 132",6,20,244.92,"B"]
[18,67,32,99,"67 / 32",7,0,65.94,"B"]
[18,67,37,104,"67 / 37",7,1,75.36,"B"]
[18,67,42,{"$f":"B1155+C1155","v":109},{"$f":"CONCATENATE(B1155,\" / \",C1155)","v":"67 / 42"},7,2,84.78,"B"]
[18,67,47,114,"67 / 47",7,3,94.2,"B"]
[18,67,52,119,"67 / 52",7,4,103.62,"B"]
[18,67,57,124,"67 / 57",7,5,113.03999999999999,"B"]
[18,67,62,129,"67 / 62",7,6,122.46,"B"]
[18,67,67,134,"67 / 67",7,7,131.88,"B"]
[18,72,32,104,"72 / 32",8,0,{"$f":"(G1161+F1161)*N$5","v":75.36},"B"]
[18,72,42,114,"72 / 42",8,2,94.2,"B"]
[18,72,52,124,"72 / 52",8,4,113.03999999999999,"B"]
[18,72,62,134,"72 / 62",8,6,131.88,"B"]
[18,72,72,144,"72 / 72",8,8,150.72,"B"]
[18,72,82,154,"72 / 82",8,10,169.56,"B"]
[18,72,92,164,"72 / 92",8,12,188.4,"B"]
[18,72,102,174,"72 / 102",8,14,207.24,"B"]
[18,72,112,184,"72 / 112",8,16,226.07999999999998,"B"]
[18,72,122,194,"72 / 122",8,18,244.92,"B"]
[18,72,132,204,"72 / 132",8,20,263.76,"B"]
[18,82,32,114,"82 / 32",10,0,94.2,"B"]
[18,82,42,124,"82 / 42",10,2,113.03999999999999,"B"]
[18,82,52,134,"82 / 52",10,4,131.88,"B"]
[18,82,62,144,"82 / 62",10,6,150.72,"B"]
[18,82,72,154,"82 / 72",10,8,169.56,"B"]
[18,82,82,164,"82 / 82",10,10,188.4,"B"]
[18,82,92,174,"82 / 92",10,12,207.24,"B"]
[18,82,102,184,"82 / 102",10,14,226.07999999999998,"B"]
[18,82,112,194,"82 / 112",10,16,244.92,"B"]
[18,82,122,204,"82 / 122",10,18,263.76,"B"]
[18,82,132,214,"82 / 132",10,20,282.60000000000002,"B"]
[18,92,32,124,"92 / 32",12,0,113.03999999999999,"B"]
[18,92,42,134,"92 / 42",12,2,131.88,"B"]
[18,92,52,144,"92 / 52",12,4,150.72,"B"]
[18,92,62,154,"92 / 62",12,6,169.56,"B"]
[18,92,72,164,"92 / 72",12,8,188.4,"B"]
[18,92,82,174,"92 / 82",12,10,207.24,"B"]
[18,92,92,184,"92 / 92",12,12,226.07999999999998,"B"]
[18,92,102,194,"92 / 102",12,14,244.92,"B"]
[18,92,112,204,"92 / 112",12,16,263.76,"B"]
[18,92,122,214,"92 / 122",12,18,282.60000000000002,"B"]
[18,92,132,224,"92 / 132",12,20,301.44,"B"]
[18,102,32,134,"102 / 32",14,0,131.88,"B"]
[18,102,42,144,"102 / 42",14,2,150.72,"B"]
[18,102,52,154,"102 / 52",14,4,169.56,"B"]
[18,102,62,164,"102 / 62",14,6,188.4,"B"]
[18,102,72,174,"102 / 72",14,8,207.24,"B"]
[18,102,82,184,"102 / 82",14,10,226.07999999999998,"B"]
[18,102,92,194,"102 / 92",14,12,244.92,"B"]
[18,102,102,204,"102 / 102",14,14,263.76,"B"]
[18,102,112,214,"102 / 112",14,16,282.60000000000002,"B"]
[18,102,122,224,"102 / 122",14,18,301.44,"B"]
[18,102,132,234,"102 / 132",14,20,320.27999999999997,"B"]
[18,112,32,144,"112 / 32",16,0,150.72,"B"]
[18,112,42,154,"112 / 42",16,2,169.56,"B"]
[18,112,52,164,"112 / 52",16,4,188.4,"B"]
[18,112,62,174,"112 / 62",16,6,207.24,"B"]
[18,112,72,184,"112 / 72",16,8,226.07999999999998,"B"]
[18,112,82,194,"112 / 82",16,10,244.92,"B"]
[18,112,92,204,"112 / 92",16,12,263.76,"B"]
[18,112,102,214,"112 / 102",16,14,282.60000000000002,"B"]
[18,112,112,224,"112 / 112",16,16,301.44,"B"]
[18,112,122,234,"112 / 122",16,18,320.27999999999997,"B"]
[18,112,132,244,"112 / 132",16,20,339.12,"B"]
[18,122,32,154,"122 / 32",18,0,169.56,"B"]
[18,122,42,164,"122 / 42",18,2,188.4,"B"]
[18,122,52,174,"122 / 52",18,4,207.24,"B"]
[18,122,62,{"$f":"B1219+C1219","v":184},{"$f":"CONCATENATE(B1219,\" / \",C1219)","v":"122 / 62"},18,6,226.07999999999998,"B"]
[18,122,72,194,"122 / 72",18,8,244.92,"B"]
[18,122,82,204,"122 / 82",18,10,263.76,"B"]
[18,122,92,214,"122 / 92",18,12,282.60000000000002,"B"]
[18,122,102,224,"122 / 102",18,14,301.44,"B"]
[18,122,112,234,"122 / 112",18,16,320.27999999999997,"B"]
[18,122,122,244,"122 / 122",18,18,{"$f":"(G1225+F1225)*N$5","v":339.12},"B"]
[18,122,132,254,"122 / 132",18,20,357.96,"B"]
[18,132,32,164,"132 / 32",20,0,188.4,"B"]
[18,132,42,174,"132 / 42",20,2,207.24,"B"]
[18,132,52,184,"132 / 52",20,4,226.07999999999998,"B"]
[18,132,62,194,"132 / 62",20,6,244.92,"B"]
[18,132,72,204,"132 / 72",20,8,263.76,"B"]
[18,132,82,214,"132 / 82",20,10,282.60000000000002,"B"]
[18,132,92,224,"132 / 92",20,12,301.44,"B"]
[18,132,102,234,"132 / 102",20,14,320.27999999999997,"B"]
[18,132,112,244,"132 / 112",20,16,339.12,"B"]
[18,132,122,254,"132 / 122",20,18,357.96,"B"]
[18,132,132,264,"132 / 132",20,20,376.8,"B"]
[19,32,0,32,"32 / 0",null,0,0,"B"]
[19,37,0,37,"37 / 0",null,1,9.42,"B"]
[19,42,0,42,"42 / 0",null,1,9.42,"B"]
[19,47,0,47,"47 / 0",null,2,18.84,"B"]
[19,52,0,52,"52 / 0",null,2,18.84,"B"]
[19,57,0,57,"57 / 0",null,3,28.259999999999998,"B"]
[19,57,0,57,"57 / 0",null,3,28.259999999999998,"B"]
[19,62,0,62,"62 / 0",null,3,28.259999999999998,"B"]
[19,72,0,72,"72 / 0",null,4,37.68,"B"]
[19,77,0,77,"77 / 0",null,5,47.1,"B"]
[19,82,0,82,"82 / 0",null,5,47.1,"B"]
[19,87,0,87,"87 / 0",null,6,56.519999999999996,"B"]
[19,92,0,92,"92 / 0",null,6,56.519999999999996,"B"]
[19,97,0,97,"97 / 0",null,7,65.94,"B"]
[19,102,0,102,"102 / 0",null,7,65.94,"B"]
[24,35,35,70,"35 / 35",1,1,{"$f":"(G1253+F1253)*N$3","v":11.72},"B"]
[24,35,40,75,"35 / 40",1,2,17.580000000000002,"B"]
[24,35,45,80,"35 / 45",1,3,23.44,"B"]
[24,35,50,85,"35 / 50",1,4,29.3,"B"]
[24,35,55,90,"35 / 55",1,5,35.160000000000004,"B"]
[24,35,60,95,"35 / 60",1,6,41.02,"B"]
[24,35,65,100,"35 / 65",1,7,46.88,"B"]
[24,35,70,105,"35 / 70",1,8,52.74,"B"]
[24,35,75,110,"35 / 75",1,9,58.6,"B"]
[24,35,80,115,"35 / 80",1,10,64.460000000000008,"B"]
[24,40,35,75,"40 / 35",2,1,17.580000000000002,"B"]
[24,40,40,80,"40 / 40",2,2,23.44,"B"]
[24,40,45,85,"40 / 45",2,3,29.3,"B"]
[24,40,50,90,"40 / 50",2,4,35.160000000000004,"B"]
[24,40,55,95,"40 / 55",2,5,41.02,"B"]
[24,40,60,100,"40 / 60",2,6,46.88,"B"]
[24,40,65,105,"40 / 65",2,7,52.74,"B"]
[24,40,70,110,"40 / 70",2,8,58.6,"B"]
[24,40,75,115,"40 / 75",2,9,64.460000000000008,"B"]
[24,40,80,120,"40 / 80",2,10,70.320000000000007,"B"]
[24,45,35,80,"45 / 35",3,1,23.44,"B"]
[24,45,40,85,"45 / 40",3,2,29.3,"B"]
[24,45,45,90,"45 / 45",3,3,35.160000000000004,"B"]
[24,45,50,95,"45 / 50",3,4,41.02,"B"]
[24,45,55,100,"45 / 55",3,5,46.88,"B"]
[24,45,60,105,"45 / 60",3,6,52.74,"B"]
[24,45,65,110,"45 / 65",3,7,58.6,"B"]
[24,45,70,115,"45 / 70",3,8,64.460000000000008,"B"]
[24,50,35,85,"50 / 35",4,1,29.3,"B"]
[24,50,40,90,"50 / 40",4,2,35.160000000000004,"B"]
[24,50,45,{"$f":"B1283+C1283","v":95},{"$f":"CONCATENATE(B1283,\" / \",C1283)","v":"50 / 45"},4,3,41.02,"B"]
[24,50,50,100,"50 / 50",4,4,46.88,"B"]
[24,50,55,105,"50 / 55",4,5,52.74,"B"]
[24,50,60,110,"50 / 60",4,6,58.6,"B"]
[24,50,65,115,"50 / 65",4,7,64.460000000000008,"B"]
[24,50,70,120,"50 / 70",4,8,70.320000000000007,"B"]
[24,55,35,90,"55 / 35",5,1,35.160000000000004,"B"]
[24,55,40,95,"55 / 40",5,2,41.02,"B"]
[24,55,45,100,"55 / 45",5,3,46.88,"B"]
[24,55,50,105,"55 / 50",5,4,52.74,"B"]
[24,55,55,110,"55 / 55",5,5,58.6,"B"]
[24,55,60,115,"55 / 60",5,6,64.460000000000008,"B"]
[24,55,65,120,"55 / 65",5,7,70.320000000000007,"B"]
[24,60,35,95,"60 / 35",6,1,41.02,"B"]
[24,60,40,100,"60 / 40",6,2,46.88,"B"]
[24,60,45,105,"60 / 45",6,3,52.74,"B"]
[24,60,50,110,"60 / 50",6,4,58.6,"B"]
[24,60,55,115,"60 / 55",6,5,64.460000000000008,"B"]
[24,60,60,120,"60 / 60",6,6,70.320000000000007,"B"]
[24,65,35,100,"65 / 35",7,1,46.88,"B"]
[24,65,40,105,"65 / 40",7,2,52.74,"B"]
[24,65,45,110,"65 / 45",7,3,58.6,"B"]
[24,65,50,115,"65 / 50",7,4,64.460000000000008,"B"]
[24,65,55,120,"65 / 55",7,5,70.320000000000007,"B"]
[24,70,40,110,"70 / 40",8,2,58.6,"B"]
[24,70,50,120,"70 / 50",8,4,70.320000000000007,"B"]
[24,80,40,120,"80 / 40",10,2,70.320000000000007,"B"]
[25,35,0,35,"35 / 0",1,null,{"$f":"(G1310+F1310)*N$3","v":5.86},"B"]
[25,40,0,40,"40 / 0",2,null,11.72,"B"]
[25,45,0,45,"45 / 0",3,null,17.580000000000002,"B"]
[25,50,0,50,"50 / 0",4,null,23.44,"B"]
[25,55,0,55,"55 / 0",5,null,29.3,"B"]
[25,60,0,60,"60 / 0",6,null,35.160000000000004,"B"]
[25,65,0,65,"65 / 0",7,null,41.02,"B"]
[25,70,0,70,"70 / 0",8,null,46.88,"B"]
[26,33,33,66,"33 / 33",0,0,{"$f":"(G1318+F1318)*N$3","v":0},"B"]
[26,33,35,68,"33 / 35",0,1,5.86,"B"]
[26,33,40,73,"33 / 40",0,2,11.72,"B"]
[26,33,45,78,"33 / 45",0,3,17.580000000000002,"B"]
[26,33,50,83,"33 / 50",0,4,23.44,"B"]
[26,33,55,88,"33 / 55",0,5,29.3,"B"]
[26,33,60,93,"33 / 60",0,6,35.160000000000004,"B"]
[26,33,65,98,"33 / 65",0,7,41.02,"B"]
[26,33,70,103,"33 / 70",0,8,46.88,"B"]
[26,33,80,113,"33 / 80",0,10,58.6,"B"]
[26,35,33,68,"35 / 33",1,0,5.86,"B"]
[26,35,35,70,"35 / 35",1,1,11.72,"B"]
[26,35,40,75,"35 / 40",1,2,17.580000000000002,"B"]
[26,35,45,80,"35 / 45",1,3,23.44,"B"]
[26,35,50,85,"35 / 50",1,4,29.3,"B"]
[26,35,55,90,"35 / 55",1,5,35.160000000000004,"B"]
[26,35,60,95,"35 / 60",1,6,41.02,"B"]
[26,35,65,100,"35 / 65",1,7,46.88,"B"]
[26,40,33,73,"40 / 33",2,0,11.72,"B"]
[26,40,35,75,"40 / 35",2,1,17.580000000000002,"B"]
[26,40,40,80,"40 / 40",2,2,23.44,"B"]
[26,40,45,85,"40 / 45",2,3,29.3,"B"]
[26,40,50,90,"40 / 50",2,4,35.160000000000004,"B"]
[26,40,55,95,"40 / 55",2,5,41.02,"B"]
[26,40,60,100,"40 / 60",2,6,46.88,"B"]
[26,40,65,105,"40 / 65",2,7,52.74,"B"]
[26,40,70,110,"40 / 70",2,8,58.6,"B"]
[26,40,80,120,"40 / 80",2,10,70.320000000000007,"B"]
[26,45,33,78,"45 / 33",3,0,17.580000000000002,"B"]
[26,45,35,{"$f":"B1347+C1347","v":80},{"$f":"CONCATENATE(B1347,\" / \",C1347)","v":"45 / 35"},3,1,23.44,"B"]
[26,45,40,85,"45 / 40",3,2,29.3,"B"]
[26,45,45,90,"45 / 45",3,3,35.160000000000004,"B"]
[26,45,50,95,"45 / 50",3,4,41.02,"B"]
[26,45,55,100,"45 / 55",3,5,46.88,"B"]
[26,45,60,105,"45 / 60",3,6,52.74,"B"]
[26,45,65,110,"45 / 65",3,7,58.6,"B"]
[26,50,33,83,"50 / 33",4,0,23.44,"B"]
[26,50,35,85,"50 / 35",4,1,29.3,"B"]
[26,50,40,90,"50 / 40",4,2,35.160000000000004,"B"]
[26,50,45,95,"50 / 45",4,3,41.02,"B"]
[26,50,50,100,"50 / 50",4,4,46.88,"B"]
[26,50,55,105,"50 / 55",4,5,52.74,"B"]
[26,50,60,110,"50 / 60",4,6,58.6,"B"]
[26,50,65,115,"50 / 65",4,7,64.460000000000008,"B"]
[26,50,70,120,"50 / 70",4,8,70.320000000000007,"B"]
[26,55,33,88,"55 / 33",5,0,29.3,"B"]
[26,55,35,90,"55 / 35",5,1,35.160000000000004,"B"]
[26,55,40,95,"55 / 40",5,2,41.02,"B"]
[26,55,45,100,"55 / 45",5,3,46.88,"B"]
[26,55,50,105,"55 / 50",5,4,52.74,"B"]
[26,55,55,110,"55 / 55",5,5,58.6,"B"]
[26,55,60,115,"55 / 60",5,6,64.460000000000008,"B"]
[26,55,65,120,"55 / 65",5,7,70.320000000000007,"B"]
[26,60,33,93,"60 / 33",6,0,35.160000000000004,"B"]
[26,60,35,95,"60 / 35",6,1,41.02,"B"]
[26,60,40,100,"60 / 40",6,2,46.88,"B"]
[26,60,45,105,"60 / 45",6,3,52.74,"B"]
[26,60,50,110,"60 / 50",6,4,58.6,"B"]
[26,60,55,115,"60 / 55",6,5,64.460000000000008,"B"]
[26,60,60,120,"60 / 60",6,6,70.320000000000007,"B"]
[26,65,33,98,"65 / 33",7,0,41.02,"B"]
[26,65,35,100,"65 / 35",7,1,46.88,"B"]
[26,65,40,105,"65 / 40",7,2,52.74,"B"]
[26,65,45,110,"65 / 45",7,3,58.6,"B"]
[26,65,50,115,"65 / 50",7,4,{"$f":"(G1382+F1382)*N$3","v":64.460000000000008},"B"]
[26,65,55,120,"65 / 55",7,5,70.320000000000007,"B"]
[26,70,33,103,"70 / 33",8,0,46.88,"B"]
[26,70,40,110,"70 / 40",8,2,58.6,"B"]
[26,70,50,120,"70 / 50",8,4,70.320000000000007,"B"]
[26,80,33,113,"80 / 33",10,0,58.6,"B"]
[26,80,40,120,"80 / 40",10,2,70.320000000000007,"B"]
[27,33,0,33,"33 / 0",0,null,0,"B"]
[27,35,0,35,"35 / 0",1,null,5.86,"B"]
[27,40,0,40,"40 / 0",2,null,11.72,"B"]
[27,45,0,45,"45 / 0",3,null,17.580000000000002,"B"]
[27,50,0,50,"50 / 0",4,null,23.44,"B"]
[27,55,0,55,"55 / 0",5,null,29.3,"B"]
[27,60,0,60,"60 / 0",6,null,35.160000000000004,"B"]
[27,65,0,65,"65 / 0",7,null,41.02,"B"]
[27,70,0,70,"70 / 0",8,null,46.88,"B"]
[30,30,30,60,"30 / 30",0,0,{"$f":"(G1398+F1398)*N$3","v":0},"B"]
[30,30,35,65,"30 / 35",0,1,5.86,"B"]
[30,30,40,70,"30 / 40",0,2,11.72,"B"]
[30,30,45,75,"30 / 45",0,3,17.580000000000002,"B"]
[30,30,50,80,"30 / 50",0,4,23.44,"B"]
[30,30,55,85,"30 / 55",0,5,29.3,"B"]
[30,30,60,90,"30 / 60",0,6,35.160000000000004,"B"]
[30,35,30,65,"35 / 30",1,0,5.86,"B"]
[30,35,35,70,"35 / 35",1,1,11.72,"B"]
[30,35,40,75,"35 / 40",1,2,17.580000000000002,"B"]
[30,35,45,80,"35 / 45",1,3,23.44,"B"]
[30,35,50,85,"35 / 50",1,4,29.3,"B"]
[30,35,55,90,"35 / 55",1,5,35.160000000000004,"B"]
[30,35,60,{"$f":"B1411+C1411","v":95},{"$f":"CONCATENATE(B1411,\" / \",C1411)","v":"35 / 60"},1,6,41.02,"B"]
[30,40,30,70,"40 / 30",2,0,11.72,"B"]
[30,40,35,75,"40 / 35",2,1,17.580000000000002,"B"]
[30,40,40,80,"40 / 40",2,2,23.44,"B"]
[30,40,45,85,"40 / 45",2,3,29.3,"B"]
[30,40,50,90,"40 / 50",2,4,35.160000000000004,"B"]
[30,40,55,95,"40 / 55",2,5,41.02,"B"]
[30,40,60,100,"40 / 60",2,6,46.88,"B"]
[30,45,30,75,"45 / 30",3,0,17.580000000000002,"B"]
[30,45,35,80,"45 / 35",3,1,23.44,"B"]
[30,45,40,85,"45 / 40",3,2,29.3,"B"]
[30,45,45,90,"45 / 45",3,3,35.160000000000004,"B"]
[30,45,50,95,"45 / 50",3,4,41.02,"B"]
[30,45,55,100,"45 / 55",3,5,46.88,"B"]
[30,45,60,105,"45 / 60",3,6,52.74,"B"]
[30,50,30,80,"50 / 30",4,0,23.44,"B"]
[30,50,35,85,"50 / 35",4,1,29.3,"B"]
[30,50,40,90,"50 / 40",4,2,35.160000000000004,"B"]
[30,50,45,95,"50 / 45",4,3,41.02,"B"]
[30,50,50,100,"50 / 50",4,4,46.88,"B"]
[30,50,55,105,"50 / 55",4,5,52.74,"B"]
[30,50,60,110,"50 / 60",4,6,58.6,"B"]
[30,55,30,85,"55 / 30",5,0,29.3,"B"]
[30,55,35,90,"55 / 35",5,1,35.160000000000004,"B"]
[30,55,40,95,"55 / 40",5,2,41.02,"B"]
[30,55,45,100,"55 / 45",5,3,46.88,"B"]
[30,55,50,105,"55 / 50",5,4,52.74,"B"]
[30,55,55,110,"55 / 55",5,5,58.6,"B"]
[30,55,60,115,"55 / 60",5,6,64.460000000000008,"B"]
[30,60,30,90,"60 / 30",6,0,35.160000000000004,"B"]
[30,60,35,95,"60 / 35",6,1,41.02,"B"]
[30,60,40,100,"60 / 40",6,2,46.88,"B"]
[30,60,45,105,"60 / 45",6,3,52.74,"B"]
[30,60,50,110,"60 / 50",6,4,58.6,"B"]
[30,60,55,115,"60 / 55",6,5,64.460000000000008,"B"]
[30,60,60,120,"60 / 60",6,6,70.320000000000007,"B"]
[31,30,30,60,"30 / 30",0,0,{"$f":"(G1447+F1447)*N$5","v":0},"B"]
[31,30,35,65,"30 / 35",0,1,{"$f":"(G1448+F1448)*N$5","v":9.42},"B"]
[31,30,40,70,"30 / 40",0,2,18.84,"B"]
[31,30,45,75,"30 / 45",0,3,28.259999999999998,"B"]
[31,30,50,80,"30 / 50",0,4,37.68,"B"]
[31,30,55,85,"30 / 55",0,5,47.1,"B"]
[31,30,60,90,"30 / 60",0,6,56.519999999999996,"B"]
[31,35,30,65,"35 / 30",1,0,9.42,"B"]
[31,35,35,70,"35 / 35",1,1,18.84,"B"]
[31,35,40,75,"35 / 40",1,2,28.259999999999998,"B"]
[31,35,45,80,"35 / 45",1,3,37.68,"B"]
[31,35,50,85,"35 / 50",1,4,47.1,"B"]
[31,35,55,90,"35 / 55",1,5,56.519999999999996,"B"]
[31,35,60,95,"35 / 60",1,6,65.94,"B"]
[31,40,30,70,"40 / 30",2,0,18.84,"B"]
[31,40,35,75,"40 / 35",2,1,28.259999999999998,"B"]
[31,40,40,80,"40 / 40",2,2,37.68,"B"]
[31,40,45,85,"40 / 45",2,3,47.1,"B"]
[31,40,50,90,"40 / 50",2,4,56.519999999999996,"B"]
[31,40,55,95,"40 / 55",2,5,65.94,"B"]
[31,40,60,100,"40 / 60",2,6,75.36,"B"]
[31,45,30,75,"45 / 30",3,0,28.259999999999998,"B"]
[31,45,35,80,"45 / 35",3,1,37.68,"B"]
[31,45,40,85,"45 / 40",3,2,47.1,"B"]
[31,45,45,90,"45 / 45",3,3,56.519999999999996,"B"]
[31,45,50,95,"45 / 50",3,4,65.94,"B"]
[31,45,55,100,"45 / 55",3,5,75.36,"B"]
[31,45,60,105,"45 / 60",3,6,84.78,"B"]
[31,50,30,{"$f":"B1475+C1475","v":80},{"$f":"CONCATENATE(B1475,\" / \",C1475)","v":"50 / 30"},4,0,37.68,"B"]
[31,50,35,85,"50 / 35",4,1,47.1,"B"]
[31,50,40,90,"50 / 40",4,2,56.519999999999996,"B"]
[31,50,45,95,"50 / 45",4,3,65.94,"B"]
[31,50,50,100,"50 / 50",4,4,75.36,"B"]
[31,50,55,105,"50 / 55",4,5,84.78,"B"]
[31,50,60,110,"50 / 60",4,6,94.2,"B"]
[31,55,30,85,"55 / 30",5,0,47.1,"B"]
[31,55,35,90,"55 / 35",5,1,56.519999999999996,"B"]
[31,55,40,95,"55 / 40",5,2,65.94,"B"]
[31,55,45,100,"55 / 45",5,3,75.36,"B"]
[31,55,50,105,"55 / 50",5,4,84.78,"B"]
[31,55,55,110,"55 / 55",5,5,94.2,"B"]
[31,55,60,115,"55 / 60",5,6,103.62,"B"]
[31,60,30,90,"60 / 30",6,0,56.519999999999996,"B"]
[31,60,35,95,"60 / 35",6,1,65.94,"B"]
[31,60,40,100,"60 / 40",6,2,75.36,"B"]
[31,60,45,105,"60 / 45",6,3,84.78,"B"]
[31,60,50,110,"60 / 50",6,4,94.2,"B"]
[31,60,55,115,"60 / 55",6,5,103.62,"B"]
[31,60,60,120,"60 / 60",6,6,113.03999999999999,"B"]
[33,30,30,60,"30 / 30",0,0,0,"B"]
[33,30,35,65,"30 / 35",0,1,{"$f":"(G1497+F1497)*N$3","v":5.86},"B"]
[33,30,40,70,"30 / 40",0,2,11.72,"B"]
[33,30,45,75,"30 / 45",0,3,17.580000000000002,"B"]
[33,30,50,80,"30 / 50",0,4,23.44,"B"]
[33,30,55,85,"30 / 55",0,5,29.3,"B"]
[33,30,60,90,"30 / 60",0,6,35.160000000000004,"B"]
[33,35,30,65,"35 / 30",1,0,5.86,"B"]
[33,35,35,70,"35 / 35",1,1,11.72,"B"]
[33,35,40,75,"35 / 40",1,2,17.580000000000002,"B"]
[33,35,45,80,"35 / 45",1,3,23.44,"B"]
[33,35,50,85,"35 / 50",1,4,29.3,"B"]
[33,35,55,90,"35 / 55",1,5,35.160000000000004,"B"]
[33,35,60,95,"35 / 60",1,6,41.02,"B"]
[33,40,30,70,"40 / 30",2,0,11.72,"B"]
[33,40,35,75,"40 / 35",2,1,17.580000000000002,"B"]
[33,40,40,80,"40 / 40",2,2,23.44,"B"]
[33,40,45,85,"40 / 45",2,3,29.3,"B"]
[33,40,50,90,"40 / 50",2,4,35.160000000000004,"B"]
[33,40,55,95,"40 / 55",2,5,41.02,"B"]
[33,40,60,100,"40 / 60",2,6,46.88,"B"]
[33,45,30,75,"45 / 30",3,0,17.580000000000002,"B"]
[33,45,35,80,"45 / 35",3,1,23.44,"B"]
[33,45,40,85,"45 / 40",3,2,29.3,"B"]
[33,45,45,90,"45 / 45",3,3,35.160000000000004,"B"]
[33,45,50,95,"45 / 50",3,4,41.02,"B"]
[33,45,55,100,"45 / 55",3,5,46.88,"B"]
[33,45,60,105,"45 / 60",3,6,52.74,"B"]
[33,50,30,80,"50 / 30",4,0,23.44,"B"]
[33,50,35,85,"50 / 35",4,1,29.3,"B"]
[33,50,40,90,"50 / 40",4,2,35.160000000000004,"B"]
[33,50,45,95,"50 / 45",4,3,41.02,"B"]
[33,50,50,100,"50 / 50",4,4,46.88,"B"]
[33,50,55,105,"50 / 55",4,5,52.74,"B"]
[33,50,60,110,"50 / 60",4,6,58.6,"B"]
[33,55,30,85,"55 / 30",5,0,29.3,"B"]
[33,55,35,90,"55 / 35",5,1,35.160000000000004,"B"]
[33,55,40,95,"55 / 40",5,2,41.02,"B"]
[33,55,45,100,"55 / 45",5,3,46.88,"B"]
[33,55,50,105,"55 / 50",5,4,52.74,"B"]
[33,55,55,110,"55 / 55",5,5,58.6,"B"]
[33,55,60,115,"55 / 60",5,6,64.460000000000008,"B"]
[33,60,30,90,"60 / 30",6,0,35.160000000000004,"B"]
[33,60,35,{"$f":"B1539+C1539","v":95},{"$f":"CONCATENATE(B1539,\" / \",C1539)","v":"60 / 35"},6,1,41.02,"B"]
[33,60,40,100,"60 / 40",6,2,46.88,"B"]
[33,60,45,105,"60 / 45",6,3,52.74,"B"]
[33,60,50,110,"60 / 50",6,4,58.6,"B"]
[33,60,55,115,"60 / 55",6,5,64.460000000000008,"B"]
[33,60,60,120,"60 / 60",6,6,{"$f":"(G1544+F1544)*N$3","v":70.320000000000007},"B"]
[34,27,35,62,"27 / 35",null,1,0,"B"]
[34,27,40,67,"27 / 40",null,2,5.68,"B"]
[35,30,0,{"$f":"B1547+C1547","v":30},{"$f":"CONCATENATE(B1547,\" / \",C1547)","v":"30 / 0"},0,null,{"$f":"(G1547+F1547)*N$3","v":0},"B"]
[35,35,0,35,"35 / 0",1,null,{"$f":"(G1548+F1548)*N$3","v":5.86},"B"]
[35,40,0,40,"40 / 0",2,null,{"$f":"(G1549+F1549)*N$3","v":11.72},"B"]
[35,45,0,45,"45 / 0",3,null,{"$f":"(G1550+F1550)*N$3","v":17.580000000000002},"B"]
[35,50,0,50,"50 / 0",4,null,{"$f":"(G1551+F1551)*N$3","v":23.44},"B"]

{"sheet":"S-Plan","index":11,"n_rows":30,"n_cols":32,"rows_kept":30,"cut":false,"hidden":false,"merged":[[0,16,7,25],[8,5,8,6],[0,0,7,10]]}
[null,null,null,null,null,null,null,null,null,null,null,"Aantal"]
[]
[null,null,null,null,null,null,null,null,null,null,null,"Type"]
[]
[]
[]
[null,null,null,null,null,null,null,null,null,null,null,"Omschrijving",null,null,null,null,null,null,null,null,null,null,null,null,null,null,null,null,null,"","",""]
[null,null,null,null,null,null,null,null,null,null,null,"Sleutelnummer",null,null,null,null,null,null,null,null,null,null,null,null,null,null,null,null,null,"","",""]
[null,null,null,"!!Niet in DOM-plan!!",null,"Aantal"]
["Positie","Status","Deur-Ruimteomschrijving","Vrije invoer","Sleutelnummer","Cil.","Sl.",null,"Cilindertype","Uitvoering","Lengte (A / B)","kleur",null,"PAusf.","PLänge","PFrb"]
[1]
[2]
[3]
[4]
[5]
[6]
[7]
[8]
[9]
[10]
[11]
[12]
[13]
[14]
[15]
[16]
[17]
[18]
[19]
[20]

{"sheet":"art_system","index":12,"n_rows":81,"n_cols":6,"rows_kept":81,"cut":false,"hidden":true,"merged":[]}
["Anlagenart","Systeme","Neuanlage E/N","Sichtbar J/N","ART","System"]
["?","?","N","J","?","?"]
["GHS","DIAMANT","E","J","?","GHS"]
["HS","IX GAMMA","E","J","?","HS"]
["ZHS","IX10KG","E","J","?","ZHS"]
["Z","IX5HT","E","J","?","Z"]
[null,"IX6KG","E","J","DIAMANT","?"]
[null,"IX6SR","E","J","DIAMANT","HS"]
[null,"IXHT","E","J","DIAMANT","GHS"]
[null,"IXSAT","E","J","IX GAMMA","ZHS"]
[null,"IXTWINSTAR","N","J","IX GAMMA","HS"]
[null,"RS SIGMA","N","J","IX GAMMA","GHS"]
[null,"RS5","E","J","IX10KG","?"]
[null,"RS8","E","J","IX10KG","Z"]
[null,"IXTWIDO","N","J","IX10KG","ZHS"]
[null,"IXTECO","N","J","IX10KG","HS"]
[null,"IXTWINSTAR-C","N","J","IX10KG","GHS"]
[null,null,null,null,"IX5HT","?"]
[null,null,null,null,"IX5HT","Z"]
[null,null,null,null,"IX5HT","ZHS"]
[null,null,null,null,"IX5HT","HS"]
[null,null,null,null,"IX5HT","GHS"]
[null,null,null,null,"IX5KG","?"]
[null,null,null,null,"IX5KG","Z"]
[null,null,null,null,"IX5KG","ZHS"]
[null,null,null,null,"IX5KG","HS"]
[null,null,null,null,"IX5KG","GHS"]
[null,null,null,null,"IX6KG","?"]
[null,null,null,null,"IX6KG","Z"]
[null,null,null,null,"IX6KG","ZHS"]
[null,null,null,null,"IX6KG","HS"]
[null,null,null,null,"IX6KG","GHS"]
[null,null,null,null,"IX6SR","?"]
[null,null,null,null,"IX6SR","Z"]
[null,null,null,null,"IX6SR","ZHS"]
[null,null,null,null,"IX6SR","HS"]
[null,null,null,null,"IX6SR","GHS"]
[null,null,null,null,"IXHT","Z"]
[null,null,null,null,"IXHT","ZHS"]
[null,null,null,null,"IXHT","HS"]
[null,null,null,null,"IXHT","GHS"]
[null,null,null,null,"IXSAT","?"]
[null,null,null,null,"IXSAT","Z"]
[null,null,null,null,"IXSAT","ZHS"]
[null,null,null,null,"IXSAT","HS"]
[null,null,null,null,"IXSAT","GHS"]
[null,null,null,null,"RS SIGMA","?"]
[null,null,null,null,"RS SIGMA","Z"]
[null,null,null,null,"RS SIGMA","ZHS"]
[null,null,null,null,"RS SIGMA","HS"]
[null,null,null,null,"RS SIGMA","GHS"]
[null,null,null,null,"RS5","?"]
[null,null,null,null,"RS5","Z"]
[null,null,null,null,"RS5","ZHS"]
[null,null,null,null,"RS5","HS"]
[null,null,null,null,"RS5","GHS"]
[null,null,null,null,"RS8","?"]
[null,null,null,null,"RS8","Z"]
[null,null,null,null,"RS8","ZHS"]
[null,null,null,null,"RS8","HS"]
[null,null,null,null,"RS8","GHS"]
[null,null,null,null,"IXTWINSTAR","?"]
[null,null,null,null,"IXTWINSTAR","Z"]
[null,null,null,null,"IXTWINSTAR","ZHS"]
[null,null,null,null,"IXTWINSTAR","HS"]
[null,null,null,null,"IXTWINSTAR","GHS"]
[null,null,null,null,"IXTWIDO","?"]
[null,null,null,null,"IXTWIDO","Z"]
[null,null,null,null,"IXTWIDO","ZHS"]
[null,null,null,null,"IXTWIDO","HS"]
[null,null,null,null,"IXTWIDO","GHS"]
[null,null,null,null,"IXTECO","?"]
[null,null,null,null,"IXTECO","Z"]
[null,null,null,null,"IXTECO","ZHS"]
[null,null,null,null,"IXTECO","HS"]
[null,null,null,null,"IXTECO","GHS"]
[null,null,null,null,"IXTWINSTAR-C","?"]
[null,null,null,null,"IXTWINSTAR-C","Z"]
[null,null,null,null,"IXTWINSTAR-C","ZHS"]
[null,null,null,null,"IXTWINSTAR-C","HS"]
[null,null,null,null,"IXTWINSTAR-C","GHS"]

{"sheet":"typen","index":13,"n_rows":721,"n_cols":44,"rows_kept":721,"cut":false,"hidden":true,"merged":[]}
["333K1SKG2|IXTWINSTAR",{"$f":"VLOOKUP($A1,$A3:$AG800,2,0)","v":"333K1SKG2"},{"$f":"VLOOKUP($A1,$A3:$AG800,3,0)","v":"IXTWINSTAR"},{"$f":"VLOOKUP($A1,$A3:$AG800,4,0)","v":171.14},{"$f":"VLOOKUP($A1,$A3:$AG800,5,0)","v":171.14},{"$f":"VLOOKUP($A1,$A3:$AG800,6,0)","v":171.14},{"$f":"VLOOKUP($A1,$A3:$AG800,7,0)","v":513.41999999999996},{"$f":"VLOOKUP($A1,$A3:$AG800,8,0)","v":33},{"$f":"VLOOKUP($A1,$A3:$AG800,9,0)","v":11},{"$f":"VLOOKUP($A1,$A3:$AG800,10,0)","v":20},{"$f":"VLOOKUP($A1,$A3:$AG800,11,0)","v":"D"},{"$f":"VLOOKUP($A1,$A3:$AG800,12,0)","v":"N"},{"$f":"VLOOKUP($A1,$A3:$AG800,13,0)","v":"333IXSTAR SKG2"},{"$f":"VLOOKUP($A1,$A3:$AG800,14,0)","v":"B_KNAUFAUSF"},{"$f":"VLOOKUP($A1,$A3:$AG800,15,0)","v":"KNK1"},{"$f":"VLOOKUP($A1,$A3:$AG800,16,0)","v":0},{"$f":"VLOOKUP($A1,$A3:$AG800,17,0)","v":0},{"$f":"VLOOKUP($A1,$A3:$AG800,18,0)","v":0},{"$f":"VLOOKUP($A1,$A3:$AG800,19,0)","v":0},{"$f":"VLOOKUP($A1,$A3:$AG800,20,0)","v":0},{"$f":"VLOOKUP($A1,$A3:$AG800,21,0)","v":0},{"$f":"VLOOKUP($A1,$A3:$AG800,22,0)","v":0},{"$f":"VLOOKUP($A1,$A3:$AG800,23,0)","v":0},{"$f":"VLOOKUP($A1,$A3:$AG800,24,0)","v":0},{"$f":"VLOOKUP($A1,$A3:$AG800,25,0)","v":0},{"$f":"VLOOKUP($A1,$A3:$AG800,26,0)","v":0},{"$f":"VLOOKUP($A1,$A3:$AG800,27,0)","v":0},{"$f":"VLOOKUP($A1,$A3:$AG800,28,0)","v":0},{"$f":"VLOOKUP($A1,$A3:$AG800,29,0)","v":0},{"$f":"VLOOKUP($A1,$A3:$AG800,30,0)","v":0},{"$f":"VLOOKUP($A1,$A3:$AG800,31,0)","v":0},{"$f":"VLOOKUP($A1,$A3:$AG800,32,0)","v":0},{"$f":"VLOOKUP($A1,$A3:$AG800,33,0)","v":0},{"$f":"VLOOKUP($A1,$A3:$AH800,34,0)","v":"B"},null,null,{"$f":"VLOOKUP($A1,$A3:$AK800,37,0)","v":0},"Aufpreis Z nach HS","Aufpreis HS nachGHS",null,{"$f":"VLOOKUP($A1,$A3:$AO800,41,0)","v":"M"},{"$f":"VLOOKUP($A1,$A3:$AP591,42,0)","v":0}]
["Typ SYS","Typ","System","PZ/ZHS","PHS","PGHS","P?","L_Länge","L_Farbe","l_ausf","Doppel","Neuanlage","MATERIAL","Merkmal1","Mwert1","Merkmal2","Mwert2","Merkmal3","Mwert3","Merkmal4","Mwert4","Merkmal5","Mwert5","Merkmal6","Mwert6","Merkmal7","Mwert7","Merkmal8","Mwert8","Merkmal9","Mwert9","Merkmal10","Mwert10","Netto","ENET","COD ES","Preisanteil merkmale",7.1,22.2,"Doppel","Variante ?","Text","fam","sorteer"]
[{"$f":"CONCATENATE(B3,\"|\",C3)","v":"333|?"},"333","?",0,0,0,{"$f":"D3+E3+F3","v":0},0,0,0,"D","N",null,null,null,null,null,null,null,null,null,null,null,null,null,null,null,null,null,null,null,null,null,"B","x",null,0,null,null,null,"M",null,null,1]
["333H|?","333H","?",0,0,0,0,0,0,0,"H","N",null,null,null,null,null,null,null,null,null,null,null,null,null,null,null,null,null,null,null,null,null,"B","x",null,0,null,null,null,"M",null,null,2]
["333K6|?","333K6","?",0,0,0,0,0,0,0,"D","N",null,null,null,null,null,null,null,null,null,null,null,null,null,null,null,null,null,null,null,null,null,"B",null,null,0,null,null,null,"M",null,null,3]
["333T|?","333T","?",0,0,0,0,0,0,0,"D","N",null,null,null,null,null,null,null,null,null,null,null,null,null,null,null,null,null,null,null,null,null,"B",null,null,0,null,null,null,"M",null,null,4]
["333M|?","333M","?",1,1,1,3,0,0,0,"D","N",null,null,null,null,null,null,null,null,null,null,null,null,null,null,null,null,null,null,null,null,null,"B","x",null,null,null,null,null,"M",null,null,5]
["333K2|?","333K2","?",0,0,0,0,0,0,0,"D","N",null,null,null,null,null,null,null,null,null,null,null,null,null,null,null,null,null,null,null,null,null,"B",null,null,0,null,null,null,"M",null,null,6]
["333KK|?","333KK","?",0,0,0,0,0,0,0,"D","N",null,null,null,null,null,null,null,null,null,null,null,null,null,null,null,null,null,null,null,null,null,"B","x",null,0,null,null,null,"M",null,null,7]
["333KL|?","333KL","?",0,0,0,0,0,0,0,"D","N",null,null,null,null,null,null,null,null,null,null,null,null,null,null,null,null,null,null,null,null,null,"B","x",null,0,null,null,null,"M",null,null,8]
["472|?","472","?",0,0,0,0,0,0,0,"D","N",null,null,null,null,null,null,null,null,null,null,null,null,null,null,null,null,null,null,null,null,null,"B",null,null,0,null,null,null,"M",null,null,9]
["472K6|?","472K6","?",0,0,0,0,0,0,0,"D","N",null,null,null,null,null,null,null,null,null,null,null,null,null,null,null,null,null,null,null,null,null,"B",null,null,0,null,null,null,"M",null,null,10]
["555P|?","555P","?",0,0,0,0,0,0,0,"H","N",null,null,null,null,null,null,null,null,null,null,null,null,null,null,null,null,null,null,null,null,null,"B","x",null,0,null,null,null,"M",null,null,11]
["555P|?","555P","?",0,0,0,0,0,0,0,"H","N",null,null,null,null,null,null,null,null,null,null,null,null,null,null,null,null,null,null,null,null,null,"B","x",null,0,null,null,null,"M",null,null,12]
["325/464|?","325/464","?",0,0,0,0,0,0,0,"H","N",null,null,null,null,null,null,null,null,null,null,null,null,null,null,null,null,null,null,null,null,null,"B","x",null,0,null,null,null,"M",null,null,13]
["777G3|?","777G3","?",0,0,0,0,0,0,21,"H","N",null,null,null,"","","","","","","","","","","","","","","","","","","B","x",70.5,null,null,null,null,"M",null,null,14]
["393|?","393","?",0,0,0,0,0,0,0,"H","N",null,null,null,null,null,null,null,null,null,null,null,null,null,null,null,null,null,null,null,null,null,"B","x",null,0,null,null,null,"M",null,null,15]
["333STAALSKG3|DIAMANT","333STAALSKG3","DIAMANT",221.59,221.59,221.59,664.77,2,5,0,"D","E","333DIA","B_AUSF_ST_DUR","SDST",null,null,null,null,null,null,null,null,null,null,null,null,null,null,null,null,null,null,"B","x",142.9,null,null,null,null,"M",null,null,90]
["333TSTAALSKG3|DIAMANT","333TSTAALSKG3","DIAMANT",229.05,229.05,229.05,687.15000000000009,2,5,0,"D","E","333DIA","B_AUSF_ST_DUR","SDST","B_FUNKTION","FUT",null,null,null,null,null,null,null,null,null,null,null,null,null,null,null,null,"B",null,null,null,null,null,null,"M",null,null,91]
["333HSTAALSKG3|DIAMANT","333HSTAALSKG3","DIAMANT",199.43,199.43,199.43,598.29,10,5,0,"H","E","333DIAH","B_AUSF_ST_DUR","SDST",null,null,null,null,null,null,null,null,null,null,null,null,null,null,null,null,null,null,"B","x",118.3,null,null,null,null,"M",null,null,92]
["333K6STAALSKG3|DIAMANT","333K6STAALSKG3","DIAMANT",232.67,232.67,232.67,698.01,2,5,0,"D","E","333DIA","B_KNAUFAUSF","KNK6","B_AUSF_ST_DUR","SDST/DUR",null,null,null,null,null,null,null,null,null,null,null,null,null,null,null,null,"B",null,null,null,null,null,null,"M",null,null,93]
["333DUR|DIAMANT","333DUR","DIAMANT",166.2,166.2,166.2,498.59999999999997,18,3,0,"D","E","333DIA","B_AUSF_ST_DUR","SDDUR",null,null,null,null,null,null,null,null,null,null,null,null,null,null,null,null,null,null,"B","x",null,null,null,null,null,"M",null,null,94]
["333TDUR|DIAMANT","333TDUR","DIAMANT",173.66,173.66,173.66,520.98,18,3,0,"D","E","333DIA","B_AUSF_ST_DUR","SDDUR","B_FUNKTION","FUT",null,null,null,null,null,null,null,null,null,null,null,null,null,null,null,null,"B","x",null,null,null,null,null,"M",null,null,94.1]
["333HDUR|DIAMANT","333HDUR","DIAMANT",149.54,149.54,149.54,448.62,19,6,0,"H","E","333DIAH","B_AUSF_ST_DUR","SDDUR",null,null,null,null,null,null,null,null,null,null,null,null,null,null,null,null,null,null,"B","x",null,null,null,null,null,"M",null,null,95]
["333K6DUR|DIAMANT","333K6DUR","DIAMANT",174.52,174.52,174.52,523.56000000000006,18,3,0,"D","E","333DIA","B_AUSF_ST_DUR","SDDUR","B_KNAUFAUSF","KNK6",null,null,null,null,null,null,null,null,null,null,null,null,null,null,null,null,"B",null,null,null,null,null,null,"M",null,null,96]
["555PDUR|DIAMANT","555PDUR","DIAMANT",174.52,174.52,174.52,523.56000000000006,0,6,0,"H","E","555DIADUR","B_AUSFUEHRUNG_ROHR_PLATTE","RPP",null,null,null,null,null,null,null,null,null,null,null,null,null,null,null,null,null,null,"B","x",74.5,null,null,null,null,"M",null,null,97]
["382DUR|DIAMANT","382DUR","DIAMANT",149.54,149.54,149.54,448.62,0,6,4,"H","E","382DIA","B_TEILENR_HEBEL_10_8_BAU","200013F013",null,null,null,null,null,null,null,null,null,null,null,null,null,null,null,null,null,null,"B","x","68,7",null,null,null,null,"M",null,null,98]
["393DUR|DIAMANT","393DUR","DIAMANT",191.12,191.12,191.12,573.36,0,6,5,"H","E","393DIADUR","B_AUSF_ST_DUR","SDDUR",null,null,null,null,null,null,null,null,null,null,null,null,null,null,null,null,null,null,"B","x",null,null,null,null,null,"M",null,null,99]
["333|IX GAMMA","333","IX GAMMA",98.28,98.28,98.28,294.84000000000003,1,7,20,"D","E","333IXGA","","","","","","","","","","","","","","","","","","","","","B","x",null,null,null,null,null,"M",null,null,1]
["333SKG2|IX GAMMA","333SKG2","IX GAMMA",105.14,105.14,105.14,315.42,33,7,20,"D","E","333IXGA SKG2","","","","","","","","","","","","","","","","","","","","","B","x",null,null,null,null,null,"M",null,null,2]
["333H|IX GAMMA","333H","IX GAMMA",88.42,88.42,88.42,265.26,4,8,8,"H","E","333IXGAH","","","","","","","","","","","","","","","","","","","","","B","x",null,null,null,null,null,"M",null,null,2.1]
["333HSKG2|IX GAMMA","333HSKG2","IX GAMMA",95.28,95.28,95.28,285.84000000000003,4,8,8,"H","E","333IXGAH SKG2","","","","","","","","","","","","","","","","","","","","","B","x",null,null,null,null,null,"M",null,null,2.2000000000000002]
["333K6|IX GAMMA","333K6","IX GAMMA",103.17,103.17,103.17,309.51,1,7,20,"D","E","333IXGA","B_KNAUFAUSF","KNK6","","","","","","","","","","","","","","","","","","","B",null,null,null,null,null,null,"M",null,null,2.2999999999999998]
["333K6SKG2|IX GAMMA","333K6SKG2","IX GAMMA",110.03,110.03,110.03,330.09000000000003,33,7,20,"D","E","333IXGA SKG2","B_KNAUFAUSF","KNK6","","","","","","","","","","","","","","","","","","","B",null,null,null,null,null,null,"M",null,null,2.4]
["333T|IX GAMMA","333T","IX GAMMA",105.74,105.74,105.74,317.21999999999997,1,7,3,"D","E","333IXGA","B_FUNKTIONEN","FUT","","","","","","","","","","","","","","","","","","","B",null,null,null,null,null,null,"M",null,null,4]
["333TSKG2|IX GAMMA","333TSKG2","IX GAMMA",112.6,112.6,112.6,337.79999999999995,33,7,3,"D","E","333IXGA SKG2","B_FUNKTIONEN","FUT","","","","","","","","","","","","","","","","","","","B",null,null,null,null,null,null,"M",null,null,5]
["333FRL|IX GAMMA","333FRL","IX GAMMA",108.47,108.47,108.47,325.40999999999997,24,7,0,"D","E","333IXGA FRL",null,null,"","","","","","","","","","","","","","","","","","","B","x",null,null,null,null,null,"M",null,null,7]
["333FRLSKG2|IX GAMMA","333FRLSKG2","IX GAMMA",115.33,115.33,115.33,345.99,24,7,0,"D","E","333IXGA FRL SKG2",null,null,"","","","","","","","","","","","","","","","","","","B","x",null,null,null,null,null,"M",null,null,8]
["333M|IX GAMMA","333M","IX GAMMA",129.38,129.38,129.38,388.14,3,7,20,"D","E","333IXGAM","","","","","","","","","","","","","","","","","","","","","B","x",null,null,null,null,null,"M",null,null,12]
["333MSKG2|IX GAMMA","333MSKG2","IX GAMMA",136.24,136.24,136.24,408.72,3,7,20,"D","E","333IXGAM SKG2","","","","","","","","","","","","","","","","","","","","","B","x",null,null,null,null,null,"M",null,null,13]
["333MT|IX GAMMA","333MT","IX GAMMA",136.84,136.84,136.84,410.52,3,7,3,"D","E","333IXGAM","B_FUNKTIONEN","FUT","","","","","","","","","","","","","","","","","","","B",null,null,null,null,null,"H","M",null,null,15]
["333HFRL|IX GAMMA","333HFRL","IX GAMMA",98.61,98.61,98.61,295.83,25,8,0,"H","E","333IXGAH FRL",null,null,"","","","","","","","","","","","","","","","","","","B","x",null,null,null,null,null,"M",null,null,24]
["333HFRLSKG2|IX GAMMA","333HFRLSKG2","IX GAMMA",105.47,105.47,105.47,316.40999999999997,25,8,0,"H","E","333IXGAH FRL SKG2",null,null,"","","","","","","","","","","","","","","","","","","B","x",null,null,null,null,null,"M",null,null,25]
["333MH|IX GAMMA","333MH","IX GAMMA",116.45,116.45,116.45,349.35,17,8,0,"H","E","333IXGAHM","","","","","","","","","","","","","","","","","","","","","B","x",null,null,null,null,null,"M",null,null,27]
["333MHSKG2|IX GAMMA","333MHSKG2","IX GAMMA",123.31,123.31,123.31,369.93,17,8,0,"H","E","333IXGAHM SKG2","","","","","","","","","","","","","","","","","","","","","B","x",null,null,null,null,null,"M",null,null,28]
["333K1|IX GAMMA","333K1","IX GAMMA",109.38,109.38,109.38,328.14,1,7,20,"D","E","333IXGA","B_KNAUFAUSF","KNK1","","","","","","","","","","","","","","","","","","","B",null,null,null,null,null,null,"M",null,null,36]
["333K1SKG2|IX GAMMA","333K1SKG2","IX GAMMA",116.24,116.24,116.24,348.71999999999997,33,7,20,"D","E","333IXGA SKG2","B_KNAUFAUSF","KNK1","","","","","","","","","","","","","","","","","","","B",null,null,null,null,null,null,"M",null,null,37]
["333K2|IX GAMMA","333K2","IX GAMMA",109.38,109.38,109.38,328.14,1,7,20,"D","E","333IXGA","B_KNAUFAUSF","KNK2","","","","","","","","","","","","","","","","","","","B",null,null,null,null,null,null,"M",null,null,39]
["333K2SKG2|IX GAMMA","333K2SKG2","IX GAMMA",116.24,116.24,116.24,348.71999999999997,33,7,20,"D","E","333IXGA SKG2","B_KNAUFAUSF","KNK2","","","","","","","","","","","","","","","","","","","B",null,null,null,null,null,null,"M",null,null,40]
["333K3|IX GAMMA","333K3","IX GAMMA",109.38,109.38,109.38,328.14,1,7,20,"D","E","333IXGA","B_KNAUFAUSF","KNK3","","","","","","","","","","","","","","","","","","","B",null,null,null,null,null,null,"M",null,null,42]
["333K3SKG2|IX GAMMA","333K3SKG2","IX GAMMA",116.24,116.24,116.24,348.71999999999997,33,7,20,"D","E","333IXGA SKG2","B_KNAUFAUSF","KNK3","","","","","","","","","","","","","","","","","","","B",null,null,null,null,null,null,"M",null,null,43]
["333K4|IX GAMMA","333K4","IX GAMMA",109.38,109.38,109.38,328.14,1,7,20,"D","E","333IXGA","B_KNAUFAUSF","KNK4","","","","","","","","","","","","","","","","","","","B",null,null,null,null,null,null,"M",null,null,45]
["333K4SKG2|IX GAMMA","333K4SKG2","IX GAMMA",116.24,116.24,116.24,348.71999999999997,33,7,20,"D","E","333IXGA SKG2","B_KNAUFAUSF","KNK4","","","","","","","","","","","","","","","","","","","B",null,null,null,null,null,null,"M",null,null,46]
["333K7|IX GAMMA","333K7","IX GAMMA",139.47999999999999,139.47999999999999,139.47999999999999,418.43999999999994,30,10,0,"D","E","333IXGA K7 SKG2",null,null,"","","","","","","","","","","","","","","","","","","B",null,null,null,null,null,null,"M",null,null,48]
["333K7SKG2|IX GAMMA","333K7SKG2","IX GAMMA",146.34,146.34,146.34,439.02,30,10,0,"D","E","333IXGA K7 SKG2",null,null,"","","","","","","","","","","","","","","","","","","B",null,null,null,null,null,null,"M",null,null,49]
["333K6KRU|IX GAMMA","333K6KRU","IX GAMMA",126.39,126.39,126.39,379.17,1,7,20,"D","E","333IXGA KRU","B_KNAUFAUSF","KNK6",null,null,null,null,null,null,null,null,null,null,null,null,null,null,null,null,null,null,"B",null,null,null,null,null,null,"M",null,null,50]
["333MK6|IX GAMMA","333MK6","IX GAMMA",135.84,135.84,135.84,407.52,3,7,20,"D","E","333IXGAM","B_KNAUFAUSF","KNK6","","","","","","","","","","","","","","","","","","","B",null,null,null,null,null,null,"M",null,null,51]
["333MK6SKG2|IX GAMMA","333MK6SKG2","IX GAMMA",142.69999999999999,142.69999999999999,142.69999999999999,428.09999999999997,3,7,20,"D","E","333IXGAM SKG2","B_KNAUFAUSF","KNK6","","","","","","","","","","","","","","","","","","","B",null,null,null,null,null,null,"M",null,null,52]
["333MK7|IX GAMMA","333MK7","IX GAMMA",172.15,172.15,172.15,516.45000000000005,31,10,0,"D","E","333IXGAM K7 SKG2",null,null,"","","","","","","","","","","","","","","","","","","B",null,null,null,null,null,null,"M",null,null,58]
["333MK7SKG2|IX GAMMA","333MK7SKG2","IX GAMMA",179.01,179.01,179.01,537.03,31,10,0,"D","E","333IXGAM K7 SKG2",null,null,"","","","","","","","","","","","","","","","","","","B",null,null,null,null,null,null,"M",null,null,59]
["333KL|IX GAMMA","333KL","IX GAMMA",103.17,103.17,103.17,309.51,5,7,18,"D","E","333IXGAKL","","","","","","","","","","","","","","","","","","","","","B","x",null,null,null,null,null,"M",null,null,62]
["333KLK6|IX GAMMA","333KLK6","IX GAMMA",103.17,103.17,103.17,309.51,5,7,0,"D","E","333IXGAKL","B_KNAUFAUSF","KNK6","","","","","","","","","","","","","","","","","","","B",null,null,null,null,null,null,"M",null,null,63]
["333KLSKG2|IX GAMMA","333KLSKG2","IX GAMMA",110.03,110.03,110.03,330.09000000000003,5,7,18,"D","E","333IXGAKL SKG2","","","","","","","","","","","","","","","","","","","","","B","x",null,null,null,null,null,"M",null,null,64]
["333KLT|IX GAMMA","333KLT","IX GAMMA",110.63,110.63,110.63,331.89,5,7,0,"D","E","333IXGAKL","B_FUNKTIONEN","FUT","","","","","","","","","","","","","","","","","","","B",null,null,null,null,null,null,"M",null,null,65]
["333RI-10|IX GAMMA","333RI-10","IX GAMMA",121.44,121.44,121.44,364.32,1,7,0,"D","E","333IXGA","B_MITNEHMERAUSF","MIRI10","","","","","","","","","","","","","","","","","","","B",null,null,null,null,null,null,"M",null,null,65.5]
["333RI-14|IX GAMMA","333RI-14","IX GAMMA",121.44,121.44,121.44,364.32,1,7,0,"D","E","333IXGA","B_MITNEHMERAUSF","MIRI14","","","","","","","","","","","","","","","","","","","B",null,null,null,null,null,null,"M",null,null,65.599999999999994]
[{"$f":"CONCATENATE(B67,\"|\",C67)","v":"472|IX GAMMA"},"472","IX GAMMA",108.61,108.61,108.61,{"$f":"D67+E67+F67","v":325.83},1,7,0,"D","E","2222IXGA","","","","","","","","","","","","","","","","","","","","","B",null,null,null,null,null,null,"M",null,null,66]
["472H|IX GAMMA","472H","IX GAMMA",97.72,97.72,97.72,293.15999999999997,4,8,8,"H","E","2222IXGAH","","","","","","","","","","","","","","","","","","","","","B",null,null,null,null,null,null,"M",null,null,67]
["472K6|IX GAMMA","472K6","IX GAMMA",114.04,114.04,114.04,342.12,1,7,0,"D","E","2222IXGA","B_KNAUFAUSF","KNK6","","","","","","","","","","","","","","","","","","","B",null,null,null,null,null,null,"M",null,null,68]
["555P|IX GAMMA","555P","IX GAMMA",103.17,103.17,103.17,309.51,0,8,0,"H","E","555IXGA","B_AUSFUEHRUNG_ROHR_PLATTE","RPP","","","","","","","","","","","","","","","","","","","B","x",null,null,null,null,null,"M",null,null,69]
["555PSKG2*|IX GAMMA","555PSKG2*","IX GAMMA",110.03,110.03,110.03,330.09000000000003,0,8,0,"H","E","555IXGA ",null,null,"","","","","","","","","","","","","","","","","","","B","x",null,null,null,null,null,"M",null,null,70]
["325L|IX GAMMA","325L","IX GAMMA",88.42,88.42,88.42,265.26,0,8,0,"H","E","325IXGA","B_AUSFUEHRUNG_325","LIPS",null,null,null,null,null,null,null,null,null,null,null,null,null,null,null,null,null,null,"B",null,null,null,null,null,null,"M",null,null,71]
["325L/1754DR1|IX GAMMA","325L/1754DR1","IX GAMMA",280.62,280.62,280.62,841.86,0,8,0,"H","E","325IXGA","B_AUSFUEHRUNG_325","LIPS",null,null,null,null,null,null,null,null,null,null,null,null,null,null,null,null,null,null,"B",null,null,null,null,null,null,"M",null,null,72]
["325L/1754DR2|IX GAMMA","325L/1754DR2","IX GAMMA",280.62,280.62,280.62,841.86,0,8,0,"H","E","325IXGA","B_AUSFUEHRUNG_325","LIPS",null,null,null,null,null,null,null,null,null,null,null,null,null,null,null,null,null,null,"B",null,null,null,null,null,null,"M",null,null,73]
["777G3|IX GAMMA","777G3","IX GAMMA",131.32,131.32,131.32,393.96,0,0,21,"H","E","777IXGAG3",null,null,"","","","","","","","","","","","","","","","","","","B","x",70.5,null,null,null,null,"M",null,null,75]
["777G3-HB60|IX GAMMA","777G3-HB60","IX GAMMA",143.18,143.18,143.18,429.54,0,0,21,"H","E","777IXGAG3","B_BUEGELLAENGE","BU60",null,null,"","","","","","","","","","","","","","","","","B","x",70.5,null,null,null,null,"M",null,null,76]
["777G3-HB120|IX GAMMA","777G3-HB120","IX GAMMA",145.9,145.9,145.9,437.70000000000005,0,0,21,"H","E","777IXGAG3","B_BUEGELLAENGE","BU120",null,null,"","","","","","","","","","","","","","","","","B","x",70.5,null,null,null,null,"M",null,null,77]
["382LI|IX GAMMA","382LI","IX GAMMA",88.42,88.42,88.42,265.26,0,8,4,"H","E","382IXGA","B_TEILENR_HEBEL_10_8_BAU","200013F013","B_AUSFUEHRUNG_LI_RE ","AGLI","","","","","","","","","","","","","","","","","B","x",null,null,null,null,null,"M",null,null,78]
["382RE|IX GAMMA","382RE","IX GAMMA",88.42,88.42,88.42,265.26,0,8,4,"H","E","382IXGA","B_TEILENR_HEBEL_10_8_BAU","200013F013","B_AUSFUEHRUNG_LI_RE ","AGRE","","","","","","","","","","","","","","","","","B","x",null,null,null,null,null,"M",null,null,79]
["393|IX GAMMA","393","IX GAMMA",160.47999999999999,160.47999999999999,160.47999999999999,481.43999999999994,0,8,5,"H","E","393IXGA",null,null,"","","","","","","","","","","","","","","","","","","B","x",null,null,null,null,null,"M",null,null,80]
["419 LIPS|IX GAMMA","419 LIPS","IX GAMMA",113,113,113,339,0,9,0,"H","E","419IXGA LIPS",null,null,null,null,null,null,null,null,null,null,null,null,null,null,null,null,null,null,null,null,"B",null,null,null,null,null,null,"M",null,null,81]
["3020/473|IX GAMMA","3020/473","IX GAMMA",0,0,0,0,0,0,0,"H","E","3020/473IXHT","B_RUNDMUTTER_3020","217060","B_TNR_FUEHRUNGSDUEBEL_BAUZYL","217128F","B_TNR_SCHLIESSBLECH_BAUZYL","222750 002","B_TNR_WERKZEUG_BAUZYLINDER","204271 002",null,null,null,null,null,null,null,null,null,null,null,null,"B",null,null,null,null,null,null,"M",null,null,84]
["3020/473 ESP|IX GAMMA","3020/473 ESP","IX GAMMA",0,0,0,0,0,0,0,"H","E","3020/473IXHT","B_RUNDMUTTER_3020","217060","B_TNR_DREHSTANGE_BAUZYL","205185 001","B_TNR_ANSCHLAGSTIFT_BAUZYL","207257F002","B_TNR_SCHLIESSHAKEN_BAUZYL","204476F002","B_TNR_SCHLIESSHAKEN_2_BAUZYL","204478F002","B_TNR_SCHLAUFEN_UNTERTEIL","218420F002","B_TNR_SCHLAUFEN_OBERTEIL","218418F002","B_TNR_SCHLIESSBLECH_BAUZYL","222750 002","B_TNR_FUEHRUNGSDUEBEL_BAUZYL","217128F","B_TNR_BUCHSE_DREHSTANGE","218422F036","B",null,null,null,null,null,null,"M",null,null,85]
["3020/4015|IX GAMMA","3020/4015","IX GAMMA",0,0,0,0,0,0,0,"H","E","3020/4015IXHT","B_RUNDMUTTER_3020","217060","B_TNR_FUEHRUNGSDUEBEL_BAUZYL","217128F","B_TNR_SCHLIESSBLECH_BAUZYL","222750 002","B_TNR_WERKZEUG_BAUZYLINDER","204271 002",null,null,null,null,null,null,null,null,null,null,null,null,"B",null,null,null,null,null,null,"M",null,null,86]
["3020/4015 ESP|IX GAMMA","3020/4015 ESP","IX GAMMA",0,0,0,0,0,0,0,"H","E","3020/4015IXHT","B_RUNDMUTTER_3020","217060","B_TNR_DREHSTANGE_BAUZYL","205185 001","B_TNR_ANSCHLAGSTIFT_BAUZYL","207257F002","B_TNR_SCHLIESSHAKEN_BAUZYL","204476F002","B_TNR_SCHLIESSHAKEN_2_BAUZYL","204478F002","B_TNR_SCHLAUFEN_UNTERTEIL","218420F002","B_TNR_SCHLAUFEN_OBERTEIL","218418F002","B_TNR_SCHLIESSBLECH_BAUZYL","222750 002","B_TNR_FUEHRUNGSDUEBEL_BAUZYL","217128F","B_TNR_BUCHSE_DREHSTANGE","218422F036","B",null,null,null,null,null,null,"M",null,null,87]
["|IX GAMMA",null,"IX GAMMA",0,0,0,0,0,0,0,null,"E",235271,null,null,null,null,null,null,null,null,null,null,null,null,null,null,null,null,null,null,null,null,"B",null,null,null,null,null,null,"M"]
["333|IX10KG","333","IX10KG",162.84,162.84,162.84,488.52,1,1,20,"D","E","333IXKG",null,null,null,null,null,null,null,null,null,null,null,null,null,null,null,null,null,null,null,null,"B","x",1,null,null,null,null,"M",null,null,1]
["333H|IX10KG","333H","IX10KG",146.53,146.53,146.53,439.59000000000003,4,4,8,"H","E","333IXKGH",null,null,null,null,null,null,null,null,null,null,null,null,null,null,null,null,null,null,null,null,"B","x",70,null,null,null,null,"M",null,null,2.1]
["333K6|IX10KG","333K6","IX10KG",170.99,170.99,170.99,512.97,1,1,20,"D","E","333IXKG","B_KNAUFAUSF","KNK6",null,null,null,null,null,null,null,null,null,null,null,null,null,null,null,null,null,null,"B",null,null,null,null,null,null,"M",null,null,2.2999999999999998]
["333T|IX10KG","333T","IX10KG",170.3,170.3,170.3,510.90000000000003,1,1,3,"D","E","333IXKG","B_FUNKTIONEN","FUT",null,null,null,null,null,null,null,null,null,null,null,null,null,null,null,null,null,null,"B",null,null,null,null,null,null,"M",null,null,4]
["333FRL|IX10KG","333FRL","IX10KG",173.03,173.03,173.03,519.09,24,1,0,"D","E","333IXKG",null,null,null,null,null,null,null,null,null,null,null,null,null,null,null,null,null,null,null,null,"B","x",102.1,null,null,null,null,"M",null,null,7]
["333M|IX10KG","333M","IX10KG",193.93,193.93,193.93,581.79,3,1,20,"D","E","333IXKGM",null,null,null,null,null,null,null,null,null,null,null,null,null,null,null,null,null,null,null,null,"B","x",null,null,null,null,null,"M",null,null,12]
["333MT|IX10KG","333MT","IX10KG",201.39,201.39,201.39,604.16999999999996,3,1,3,"D","E","333IXKGM","B_FUNKTIONEN","FUT",null,null,null,null,null,null,null,null,null,null,null,null,null,null,null,null,null,null,"B",null,null,null,null,null,null,"M",null,null,15]
["333HFRL|IX10KG","333HFRL","IX10KG",156.72,156.72,156.72,470.15999999999997,25,4,8,"H","E","333IXKGH ",null,"MIFRLIX",null,null,null,null,null,null,null,null,null,null,null,null,null,null,null,null,null,null,"B","x",70,null,null,null,null,"M",null,null,24]
["333MH|IX10KG","333MH","IX10KG",174.54,174.54,174.54,523.62,17,4,0,"H","E","333IXKGHM",null,null,null,null,null,null,null,null,null,null,null,null,null,null,null,null,null,null,null,null,"B","x",null,null,null,null,null,"M",null,null,27]
["333K1|IX10KG","333K1","IX10KG",177.2,177.2,177.2,531.59999999999991,1,1,20,"D","E","333IXKG","B_KNAUFAUSF","KNK1",null,null,null,null,null,null,null,null,null,null,null,null,null,null,null,null,null,null,"B",null,null,null,null,null,null,"M",null,null,36]
["333K2|IX10KG","333K2","IX10KG",177.2,177.2,177.2,531.59999999999991,1,1,20,"D","E","333IXKG","B_KNAUFAUSF","KNK2",null,null,null,null,null,null,null,null,null,null,null,null,null,null,null,null,null,null,"B",null,null,null,null,null,null,"M",null,null,39]
["333K3|IX10KG","333K3","IX10KG",177.2,177.2,177.2,531.59999999999991,1,1,20,"D","E","333IXKG","B_KNAUFAUSF","KNK3",null,null,null,null,null,null,null,null,null,null,null,null,null,null,null,null,null,null,"B",null,null,null,null,null,null,"M",null,null,42]
["333K4|IX10KG","333K4","IX10KG",177.2,177.2,177.2,531.59999999999991,1,1,0,"D","E","333IXKG","B_KNAUFAUSF","KNK4",null,null,null,null,null,null,null,null,null,null,null,null,null,null,null,null,null,null,"B",null,null,null,null,null,null,"M",null,null,45]
["333MK6|IX10KG","333MK6","IX10KG",203.65,203.65,203.65,610.95000000000005,3,1,20,"D","E","333IXKGM","B_KNAUFAUSF","KNK6",null,null,null,null,null,null,null,null,null,null,null,null,null,null,null,null,null,null,"B",null,null,null,null,null,null,"M",null,null,51]
["472|IX10KG","472","IX10KG",187.29,187.29,187.29,561.87,26,1,0,"D","E","2222IXKG",null,null,null,null,null,null,null,null,null,null,null,null,null,null,null,null,null,null,null,null,"B",null,null,null,null,null,null,"M",null,null,66]
["472H|IX10KG","472H","IX10KG",168.52,168.52,168.52,505.56000000000006,27,4,8,"H","E","2222HIXKG",null,null,null,null,null,null,null,null,null,null,null,null,null,null,null,null,null,null,null,null,"B",null,null,null,null,null,null,"M",null,null,67]
["472K6|IX10KG","472K6","IX10KG",196.66,196.66,196.66,589.98,26,1,0,"D","E","2222IXKG","B_KNAUFAUSF","KNK6",null,null,null,null,null,null,null,null,null,null,null,null,null,null,null,null,null,null,"B",null,null,null,null,null,null,"M",null,null,68]
["555P|IX10KG","555P","IX10KG",170.99,170.99,170.99,512.97,0,4,0,"H","E","555IXKG","B_AUSFUEHRUNG_ROHR_PLATTE","RPP",null,null,null,null,null,null,null,null,null,null,null,null,null,null,null,null,null,null,"B","x",62.2,null,null,null,null,"M",null,null,69]
["777G3|IX10KG","777G3","IX10KG",189.43,189.43,189.43,568.29,0,0,21,"H","E","777IXKGG3",null,null,null,null,null,null,null,null,null,null,null,null,null,null,null,null,null,null,null,null,"B","x",1,null,null,null,null,"M",null,null,75]
["777G3-HB60|IX10KG","777G3-HB60","IX10KG",201.29,201.29,201.29,603.87,0,0,21,"H","E","777IXKGG3","B_BUEGELLAENGE","BU60",null,null,null,null,null,null,null,null,null,null,null,null,null,null,null,null,null,null,"B","x",null,null,null,null,"H","M",null,null,76]
["393|IX10KG","393","IX10KG",187.29,187.29,187.29,561.87,0,4,5,"H","E","393IXKG",null,null,null,null,null,null,null,null,null,null,null,null,null,null,null,null,null,null,null,null,"B","x",110.6,null,null,null,null,"M",null,null,80]
["|IX10KG",null,"IX10KG",0,0,0,0,0,0,0,null,"E",235271,null,null,null,null,null,null,null,null,null,null,null,null,null,null,null,null,null,null,null,null,"B",null,null,null,null,null,null,"M"]
["333|IX5HT","333","IX5HT",118.19,118.19,118.19,354.57,1,1,20,"D","E","333IX5HT","","","","","","","","","","","","","","","","","","","","","B","x",null,null,null,null,null,"M",null,null,1]
["333H|IX5HT","333H","IX5HT",106.36,106.36,106.36,319.08,4,4,8,"H","E","333IX5HTH","","","","","","","","","","","","","","","","","","","","","B","x",null,null,null,null,null,"M",null,null,2.1]
["333K6|IX5HT","333K6","IX5HT",124.06,124.06,124.06,372.18,1,1,20,"D","E","333IX5HT","B_KNAUFAUSF","KNK6","","","","","","","","","","","","","","","","","","","B",null,null,null,null,null,null,"M",null,null,2.2999999999999998]
["333T|IX5HT","333T","IX5HT",125.65,125.65,125.65,376.95000000000005,1,1,3,"D","E","333IX5HT","B_FUNKTIONEN","FUT","","","","","","","","","","","","","","","","","","","B",null,null,null,null,null,null,"M",null,null,4]
["333FRL|IX5HT","333FRL","IX5HT",128.38,128.38,128.38,385.14,24,1,0,"D","E","333IX5HT FRL",null,null,"","","","","","","","","","","","","","","","","","","B","x",null,null,null,null,null,"M",null,null,7]
["333M|IX5HT","333M","IX5HT",149.31,149.31,149.31,447.93,3,1,20,"D","E","333IX5HTM","","","","","","","","","","","","","","","","","","","","","B","x",null,null,null,null,null,"M",null,null,12]
["333MT|IX5HT","333MT","IX5HT",156.77000000000001,156.77000000000001,156.77000000000001,470.31000000000006,3,1,3,"D","E","333IX5HTM","B_FUNKTIONEN","FUT","","","","","","","","","","","","","","","","","","","B",null,null,null,null,null,null,"M",null,null,15]
["333HFRL|IX5HT","333HFRL","IX5HT",116.55,116.55,116.55,349.65,25,4,8,"H","E","333IX5HTH FRL",null,null,null,null,null,null,"","","","","","","","","","","","","","","B","x",null,null,null,null,null,"M",null,null,24]
["333MH|IX5HT","333MH","IX5HT",134.34,134.34,134.34,403.02,17,4,0,"H","E","333IX5HTHM","","","","","","","","","","","","","","","","","","","","","B","x",null,null,null,null,null,"M",null,null,27]
["333K1|IX5HT","333K1","IX5HT",130.27000000000001,130.27000000000001,130.27000000000001,390.81000000000006,1,1,20,"D","E","333IX5HT","B_KNAUFAUSF","KNK1","","","","","","","","","","","","","","","","","","","B",null,null,null,null,null,null,"M",null,null,36]
["333K2|IX5HT","333K2","IX5HT",130.27000000000001,130.27000000000001,130.27000000000001,390.81000000000006,1,1,20,"D","E","333IX5HT","B_KNAUFAUSF","KNK2","","","","","","","","","","","","","","","","","","","B",null,null,null,null,null,null,"M",null,null,39]
["333K3|IX5HT","333K3","IX5HT",130.27000000000001,130.27000000000001,130.27000000000001,390.81000000000006,1,1,20,"D","E","333IX5HT","B_KNAUFAUSF","KNK3",null,null,null,null,null,null,null,null,null,null,null,null,null,null,null,null,null,null,"B",null,null,null,null,null,null,"M",null,null,42]
["333K4|IX5HT","333K4","IX5HT",130.27000000000001,130.27000000000001,130.27000000000001,390.81000000000006,1,1,0,"D","E","333IX5HT","B_KNAUFAUSF","KNK4",null,null,null,null,null,null,null,null,null,null,null,null,null,null,null,null,null,null,"B",null,null,null,null,null,null,"M",null,null,45]
["333MK6|IX5HT","333MK6","IX5HT",156.72999999999999,156.72999999999999,156.72999999999999,470.18999999999994,3,1,20,"D","E","333IX5HTM","B_KNAUFAUSF","KNK6","","","","","","","","","","","","","","","","","","","B",null,null,null,null,null,null,"M",null,null,51]
["333KL|IX5HT","333KL","IX5HT",124.06,124.06,124.06,372.18,5,1,18,"D","E","333IX5HTKL","","","","","","","","","","","","","","","","","","","","","B","x",null,null,null,null,null,"M",null,null,62]
["333KLT|IX5HT","333KLT","IX5HT",131.52000000000001,131.52000000000001,131.52000000000001,394.56000000000006,5,1,0,"D","E","333IX5HTKL","B_FUNKTIONEN","FUT","","","","","","","","","","","","","","","","","","","B",null,null,null,null,null,null,"M",null,null,65]
["472|IX5HT","472","IX5HT",122.3,122.3,122.3,366.9,1,1,0,"D","E","2222IX5HT","","","","","","","","","","","","","","","","","","","","","B",null,null,null,null,null,null,"M",null,null,66]
["472H|IX5HT","472H","IX5HT",110.04,110.04,110.04,330.12,4,4,8,"H","E","2222HIX5HT","","","","","","","","","","","","","","","","","","","","","B",null,null,null,null,null,null,"M",null,null,67]
["472K6|IX5HT","472K6","IX5HT",128.41,128.41,128.41,385.23,1,1,0,"D","E","2222IX5HT","B_KNAUFAUSF","KNK6","","","","","","","","","","","","","","","","","","","B",null,null,null,null,null,null,"M",null,null,68]
["555P|IX5HT","555P","IX5HT",124.06,124.06,124.06,372.18,0,4,0,"H","E","555IX5HT","B_AUSFUEHRUNG_ROHR_PLATTE","RPP","","","","","","","","","","","","","","","","","","","B","x",null,null,null,null,null,"M",null,null,69]
["325L|IX5HT","325L","IX5HT",106.36,106.36,106.36,319.08,0,1,0,"H","E","325IX5HT","B_AUSFUEHRUNG_325","LIPS",null,null,null,null,null,null,null,null,null,null,null,null,null,null,null,null,null,null,"B",null,null,null,null,null,null,"M",null,null,71]
["325L/1754DR1|IX5HT","325L/1754DR1","IX5HT",298.56,298.56,298.56,895.68000000000006,0,1,0,"H","E","325IX5HT","B_AUSFUEHRUNG_325","LIPS",null,null,null,null,null,null,null,null,null,null,null,null,null,null,null,null,null,null,"B",null,null,null,null,null,null,"M",null,null,72]
[{"$f":"CONCATENATE(B131,\"|\",C131)","v":"325L/1754DR2|IX5HT"},"325L/1754DR2","IX5HT",298.56,298.56,298.56,{"$f":"D131+E131+F131","v":895.68000000000006},0,1,0,"H","E","325IX5HT","B_AUSFUEHRUNG_325","LIPS",null,null,null,null,null,null,null,null,null,null,null,null,null,null,null,null,null,null,"B",null,null,null,null,null,null,"M",null,null,73]
["325/464|IX5HT","325/464","IX5HT",0,0,0,0,0,0,0,"H","E","325IX5HT3464",null,null,null,null,null,null,null,null,null,null,null,null,null,null,null,null,null,null,null,null,"B",null,null,null,null,null,null,"M",null,null,74]
["777G3|IX5HT","777G3","IX5HT",149.26,149.26,149.26,447.78,0,0,21,"H","E","777IX5HTG3",null,null,null,null,"","","","","","","","","","","","","","","","","B","x",70.5,null,null,null,null,"M",null,null,75]
["777G3-HB60|IX5HT","777G3-HB60","IX5HT",161.12,161.12,161.12,483.36,0,0,21,"H","E","777IX5HTG3","B_BUEGELLAENGE","BU60",null,null,"","","","","","","","","","","","","","","","","B","x",1,null,null,null,null,"M",null,null,76]
["393|IX5HT","393","IX5HT",135.88999999999999,135.88999999999999,135.88999999999999,407.66999999999996,0,4,5,"H","E","393IX5HT",null,null,"","","","","","","","","","","","","","","","","","","B","x",null,null,null,null,null,"M",null,null,80]
["419 LIPS|IX5HT","419 LIPS","IX5HT",141.82,141.82,141.82,425.46,0,9,0,null,"E","419IX5HT LIPS",null,null,null,null,null,null,null,null,null,null,null,null,null,null,null,null,null,null,null,null,"B",null,null,null,null,null,null,"M",null,null,81]
["464/325-L|IX5HT","464/325-L","IX5HT",0,0,0,0,0,4,19,"H","E","3464IX5HT","B_AUSFUEHRUNG_LI_RE","AGLI",null,null,null,null,null,null,null,null,null,null,null,null,null,null,null,null,null,null,"B","X",null,null,null,null,null,"M",null,null,82]
["464/325-R|IX5HT","464/325-R","IX5HT",0,0,0,0,0,4,19,"H","E","3464IX5HT","B_AUSFUEHRUNG_LI_RE","AGRE","","","","","","","","","","","","","","","","","","","B","x",null,null,null,null,null,"M",null,null,83]
["|IX5HT",null,"IX5HT",0,0,0,0,0,0,0,null,"E",235271,null,null,null,null,null,null,null,null,null,null,null,null,null,null,null,null,null,null,null,null,"B",null,null,null,null,null,null,"M"]
["333|IX5KG","333","IX5KG",150.69999999999999,150.69999999999999,150.69999999999999,452.09999999999997,1,1,20,"D","E","333IX5KG",null,null,null,null,null,null,null,null,null,null,null,null,null,null,null,null,null,null,null,null,"B","x",1,null,null,null,null,"M",null,null,1]
["333H|IX5KG","333H","IX5KG",135.66,135.66,135.66,406.98,4,4,8,"H","E","333IX5KGH",null,null,null,null,null,null,null,null,null,null,null,null,null,null,null,null,null,null,null,null,"B","x",1,null,null,null,null,"M",null,null,2.1]
["333K6|IX5KG","333K6","IX5KG",158.24,158.24,158.24,474.72,1,1,20,"D","E","333IX5KG","B_KNAUFAUSF","KNK6",null,null,null,null,null,null,null,null,null,null,null,null,null,null,null,null,null,null,"B",null,null,null,null,null,null,"M",null,null,2.2999999999999998]
["333T|IX5KG","333T","IX5KG",158.16,158.16,158.16,474.48,1,1,3,"D","E","333IX5KG","B_FUNKTIONEN","FUT",null,null,null,null,null,null,null,null,null,null,null,null,null,null,null,null,null,null,"B",null,null,null,null,null,null,"M",null,null,4]
["333HFRL|IX5KG","333HFRL","IX5KG",145.85,145.85,145.85,437.54999999999995,25,4,8,"H","E","333IX5KGH MIWE",null,null,null,null,null,null,null,null,null,null,null,null,null,null,null,null,null,null,null,null,"B","x",1,null,null,null,null,"M",null,null,24]
["333K1|IX5KG","333K1","IX5KG",164.45,164.45,164.45,493.34999999999997,1,1,20,"D","E","333IX5KG","B_KNAUFAUSF","KNK1",null,null,null,null,null,null,null,null,null,null,null,null,null,null,null,null,null,null,"B",null,null,null,null,null,null,"M",null,null,36]
["333K2|IX5KG","333K2","IX5KG",164.45,164.45,164.45,493.34999999999997,1,1,20,"D","E","333IX5KG","B_KNAUFAUSF","KNK2",null,null,null,null,null,null,null,null,null,null,null,null,null,null,null,null,null,null,"B",null,null,null,null,null,"D","M",null,null,39]
["333K3|IX5KG","333K3","IX5KG",164.45,164.45,164.45,493.34999999999997,1,1,20,"D","E","333IX5KG","B_KNAUFAUSF","KNK3",null,null,null,null,null,null,null,null,null,null,null,null,null,null,null,null,null,null,"B",null,null,null,null,null,null,"M",null,null,42]
["333K4|IX5KG","333K4","IX5KG",164.45,164.45,164.45,493.34999999999997,1,1,0,"D","E","333IX5KG","B_KNAUFAUSF","KNK4",null,null,null,null,null,null,null,null,null,null,null,null,null,null,null,null,null,null,"B",null,null,null,null,null,null,"M",null,null,45]
["333KL|IX5KG","333KL","IX5KG",158.24,158.24,158.24,474.72,5,1,18,"D","E","333IX5KGKL",null,null,null,null,null,null,null,null,null,null,null,null,null,null,null,null,null,null,null,null,"B","x",1,null,null,null,null,"M",null,null,62]
["472|IX5KG","472","IX5KG",173.35,173.35,173.35,520.04999999999995,1,1,0,"D","E","2222IX5KG",null,null,null,null,null,null,null,null,null,null,null,null,null,null,null,null,null,null,null,null,"B",null,null,null,null,null,null,"M",null,null,66]
["472H|IX5KG","472H","IX5KG",156.01,156.01,156.01,468.03,4,4,8,"H","E","2222HIX5KG",null,null,null,null,null,null,null,null,null,null,null,null,null,null,null,null,null,null,null,null,"B",null,null,null,null,null,null,"M",null,null,67]
["472K6|IX5KG","472K6","IX5KG",181.98,181.98,181.98,545.93999999999994,1,1,0,"D","E","2222IX5KG","B_KNAUFAUSF","KNK6",null,null,null,null,null,null,null,null,null,null,null,null,null,null,null,null,null,null,"B",null,null,null,null,null,null,"M",null,null,68]
["555P|IX5KG","555P","IX5KG",158.24,158.24,158.24,474.72,0,4,0,"H","E","555IX5KG","B_AUSFUEHRUNG_ROHR_PLATTE","RPP",null,null,null,null,null,null,null,null,null,null,null,null,null,null,null,null,null,null,"B","x",1,null,null,null,null,"M",null,null,69]
["325/464|IX5KG","325/464","IX5KG",0,0,0,0,0,0,0,"H","E","325IX5KG3464",null,null,null,null,null,null,null,null,null,null,null,null,null,null,null,null,null,null,null,null,"B",null,null,null,null,null,null,"M",null,null,74]
["777G3|IX5KG","777G3","IX5KG",178.56,178.56,178.56,535.68000000000006,0,0,21,"H","E","777IX5KGG3",null,null,null,null,null,null,null,null,null,null,null,null,null,null,null,null,null,null,null,null,"B","x",null,null,null,null,null,"M",null,null,75]
["393|IX5KG","393","IX5KG",173.35,173.35,173.35,520.04999999999995,0,4,5,"H","E","393IX5KG",null,null,null,null,null,null,null,null,null,null,null,null,null,null,null,null,null,null,null,null,"B","x",null,null,null,null,null,"M",null,null,80]
["|IX5KG",null,"IX5KG",0,0,0,0,0,0,0,null,"E",235271,null,null,null,null,null,null,null,null,null,null,null,null,null,null,null,null,null,null,null,null,"B",null,null,null,null,null,null,"M"]
["333|IX6KG","333","IX6KG",150.69999999999999,150.69999999999999,150.69999999999999,452.09999999999997,1,1,20,"D","E","333IX6KG",null,null,null,null,null,null,null,null,null,null,null,null,null,null,null,null,null,null,null,null,"B","x",1,null,null,null,null,"M",null,null,1]
["333H|IX6KG","333H","IX6KG",135.66,135.66,135.66,406.98,4,4,8,"H","E","333IX6KGH",null,null,null,null,null,null,null,null,null,null,null,null,null,null,null,null,null,null,null,null,"B","x",1,null,null,null,null,"M",null,null,2.1]
["333K6|IX6KG","333K6","IX6KG",158.24,158.24,158.24,474.72,1,1,20,"D","E","333IX6KG","B_KNAUFAUSF","KNK6",null,null,null,null,null,null,null,null,null,null,null,null,null,null,null,null,null,null,"B",null,null,null,null,null,null,"M",null,null,2.2999999999999998]
["333T|IX6KG","333T","IX6KG",158.16,158.16,158.16,474.48,1,1,3,"D","E","333IX6KG","B_FUNKTIONEN","FUT",null,null,null,null,null,null,null,null,null,null,null,null,null,null,null,null,null,null,"B",null,null,null,null,null,null,"M",null,null,4]
["333FRL|IX6KG","333FRL","IX6KG",160.88999999999999,160.88999999999999,160.88999999999999,482.66999999999996,24,1,0,"D","E","333IX6KG FRL",null,null,null,null,null,null,null,null,null,null,null,null,null,null,null,null,null,null,null,null,"B","x",102.1,null,null,null,null,"M",null,null,7]
["333HFRL|IX6KG","333HFRL","IX6KG",145.85,145.85,145.85,437.54999999999995,25,4,8,"H","E","333IX6KGH FRL",null,null,null,null,null,null,null,null,null,null,null,null,null,null,null,null,null,null,null,null,"B","x",1,null,null,null,"H","M",null,null,24]
["333K1|IX6KG","333K1","IX6KG",164.45,164.45,164.45,493.34999999999997,1,1,20,"D","E","333IX6KG","B_KNAUFAUSF","KNK1",null,null,null,null,null,null,null,null,null,null,null,null,null,null,null,null,null,null,"B",null,null,null,null,null,null,"M",null,null,36]
["333K2|IX6KG","333K2","IX6KG",164.45,164.45,164.45,493.34999999999997,1,1,20,"D","E","333IX6KG","B_KNAUFAUSF","KNK2",null,null,null,null,null,null,null,null,null,null,null,null,null,null,null,null,null,null,"B",null,null,null,null,null,null,"M",null,null,39]
["333K3|IX6KG","333K3","IX6KG",164.45,164.45,164.45,493.34999999999997,1,1,20,"D","E","333IX6KG","B_KNAUFAUSF","KNK3",null,null,null,null,null,null,null,null,null,null,null,null,null,null,null,null,null,null,"B",null,null,null,null,null,null,"M",null,null,42]
["333K4|IX6KG","333K4","IX6KG",164.45,164.45,164.45,493.34999999999997,1,1,0,"D","E","333IX6KG","B_KNAUFAUSF","KNK4",null,null,null,null,null,null,null,null,null,null,null,null,null,null,null,null,null,null,"B",null,null,null,null,null,null,"M",null,null,45]
["333KL|IX6KG","333KL","IX6KG",158.24,158.24,158.24,474.72,5,1,18,"D","E","333IX6KGKL",null,null,null,null,null,null,null,null,null,null,null,null,null,null,null,null,null,null,null,null,"B","x",1,null,null,null,null,"M",null,null,62]
["472|IX6KG","472","IX6KG",173.35,173.35,173.35,520.04999999999995,1,1,0,"D","E","2222IX6KG",null,null,null,null,null,null,null,null,null,null,null,null,null,null,null,null,null,null,null,null,"B",null,null,null,null,null,null,"M",null,null,66]
["472H|IX6KG","472H","IX6KG",156.01,156.01,156.01,468.03,4,4,8,"H","E","2222HIX6KG",null,null,null,null,null,null,null,null,null,null,null,null,null,null,null,null,null,null,null,null,"B",null,null,null,null,null,null,"M",null,null,67]
["472K6|IX6KG","472K6","IX6KG",181.98,181.98,181.98,545.93999999999994,1,1,0,"D","E","2222IX6KG","B_KNAUFAUSF","KNK6",null,null,null,null,null,null,null,null,null,null,null,null,null,null,null,null,null,null,"B",null,null,null,null,null,null,"M",null,null,68]
["555P|IX6KG","555P","IX6KG",158.24,158.24,158.24,474.72,0,4,0,"H","E","555IX6KG","B_AUSFUEHRUNG_ROHR_PLATTE","RPP",null,null,null,null,null,null,null,null,null,null,null,null,null,null,null,null,null,null,"B","x",1,null,null,null,null,"M",null,null,69]
["325L|IX6KG","325L","IX6KG",135.66,135.66,135.66,406.98,0,1,0,"H","E","325IX6KG","B_AUSFUEHRUNG_325","LIPS",null,null,null,null,null,null,null,null,null,null,null,null,null,null,null,null,null,null,"B",null,null,null,null,null,null,"M",null,null,71]
["325L/1754DR1|IX6KG","325L/1754DR1","IX6KG",327.86,327.86,327.86,983.58,0,1,0,"H","E","325IX6KG","B_AUSFUEHRUNG_325","LIPS",null,null,null,null,null,null,null,null,null,null,null,null,null,null,null,null,null,null,"B",null,null,null,null,null,null,"M",null,null,72]
["325L/1754DR2|IX6KG","325L/1754DR2","IX6KG",327.86,327.86,327.86,983.58,0,1,0,"H","E","325IX6KG","B_AUSFUEHRUNG_325","LIPS",null,null,null,null,null,null,null,null,null,null,null,null,null,null,null,null,null,null,"B",null,null,null,null,null,null,"M",null,null,73]
["325/464|IX6KG","325/464","IX6KG",0,0,0,0,0,0,0,"H","E","325IX6KG3464",null,null,null,null,null,null,null,null,null,null,null,null,null,null,null,null,null,null,null,null,"B",null,null,null,null,null,null,"M",null,null,74]
["777G3|IX6KG","777G3","IX6KG",178.56,178.56,178.56,535.68000000000006,0,0,21,"H","E","777IX6KGG3",null,null,null,null,null,null,null,null,null,null,null,null,null,null,null,null,null,null,null,null,"B","x",1,null,null,null,null,"M",null,null,75]
["777G3-HB60|IX6KG","777G3-HB60","IX6KG",190.42,190.42,190.42,571.26,0,0,21,"H","E","777IX6KGG3","B_BUEGELLAENGE","BU60",null,null,"","","","","","","","","","","","","","","","","B","x",70.5,null,null,null,null,"M",null,null,76]
["393|IX6KG","393","IX6KG",173.35,173.35,173.35,520.04999999999995,0,4,5,"H","E","393IX6KG",null,null,null,null,null,null,null,null,null,null,null,null,null,null,null,null,null,null,null,null,"B","x",null,null,null,null,null,"M",null,null,80]
["|IX6KG",null,"IX6KG",0,0,0,0,0,0,0,null,"E",235271,null,null,null,null,null,null,null,null,null,null,null,null,null,null,null,null,null,null,null,null,"B",null,null,null,null,null,null,"M"]
["333|IX6SR","333","IX6SR",150.69999999999999,150.69999999999999,150.69999999999999,452.09999999999997,1,1,20,"D","E","333IX6SR","","","","","","","","","","","","","","","","","","","","","B","x",null,null,null,null,null,"M",null,null,1]
["333SKG2|IX6SR","333SKG2","IX6SR",157.56,157.56,157.56,472.68,33,1,20,"D","E","333IX6SR SKG2     ",null,null,null,null,null,null,null,null,null,null,null,null,null,null,null,null,null,null,null,null,"B",null,null,null,null,null,null,"M",null,null,2]
["333H|IX6SR","333H","IX6SR",135.66,135.66,135.66,406.98,4,4,8,"H","E","333IX6SRH","","","","","","","","","","","","","","","","","","","","","B","x",null,null,null,null,null,"M",null,null,2.1]
["333HSKG2|IX6SR","333HSKG2","IX6SR",142.52000000000001,142.52000000000001,142.52000000000001,427.56000000000006,4,4,8,"H","E","333IX6SRH SKG2    ",null,null,null,null,null,null,null,null,null,null,null,null,null,null,null,null,null,null,null,null,"B",null,null,null,null,null,null,"M",null,null,2.2000000000000002]
["333K6|IX6SR","333K6","IX6SR",158.24,158.24,158.24,474.72,1,1,20,"D","E","333IX6SR","B_KNAUFAUSF","KNK6","","","","","","","","","","","","","","","","","","","B",null,null,null,null,null,null,"M",null,null,2.2999999999999998]
["333K6SKG2|IX6SR","333K6SKG2","IX6SR",165.1,165.1,165.1,495.29999999999995,1,1,20,"D","E","333IX6SR SKG2     ","B_KNAUFAUSF","KNK6",null,null,null,null,null,null,null,null,null,null,null,null,null,null,null,null,null,null,"B",null,null,null,null,null,null,"M",null,null,2.4]
["333T|IX6SR","333T","IX6SR",158.16,158.16,158.16,474.48,1,1,3,"D","E","333IX6SR","B_FUNKTIONEN","FUT",null,null,null,null,"","","","","","","","","","","","","","","B",null,null,null,null,null,null,"M",null,null,4]
["333TSKG2|IX6SR","333TSKG2","IX6SR",165.02,165.02,165.02,495.06000000000006,1,1,3,"D","E","333IX6SR SKG2","B_FUNKTIONEN","FUT",null,null,null,null,null,null,null,null,null,null,null,null,null,null,null,null,null,null,"B",null,null,null,null,null,null,"M",null,null,5]
["333FRL|IX6SR","333FRL","IX6SR",160.88999999999999,160.88999999999999,160.88999999999999,482.66999999999996,24,1,0,"D","E","333IX6SR FRL",null,null,"","","","","","","","","","","","","","","","","","","B","x",null,null,null,null,null,"M",null,null,7]
["333FRLSKG2|IX6SR","333FRLSKG2","IX6SR",167.75,167.75,167.75,503.25,24,1,0,"D","E","333IX6SR FRL SKG2     ",null,null,null,null,null,null,null,null,null,null,null,null,null,null,null,null,null,null,null,null,"B",null,null,null,null,null,null,"M",null,null,8]
["333M|IX6SR","333M","IX6SR",181.8,181.8,181.8,545.40000000000009,3,1,20,"D","E","333IX6SRM",null,null,null,null,null,null,"","","","","","","","","","","","","","","B","x",null,null,null,null,null,"M",null,null,12]
["333MSKG2|IX6SR","333MSKG2","IX6SR",188.66,188.66,188.66,565.98,3,1,20,"D","E","333IX6SRM SKG2    ",null,null,null,null,null,null,null,null,null,null,null,null,null,null,null,null,null,null,null,null,"B",null,null,null,null,null,null,"M",null,null,13]
["333MT|IX6SR","333MT","IX6SR",189.26,189.26,189.26,567.78,3,1,3,"D","E","333IX6SRM","B_FUNKTIONEN","FUT","","","","","","","","","","","","","","","","","","","B",null,null,null,null,null,null,"M",null,null,15]
["333HFRL|IX6SR","333HFRL","IX6SR",145.85,145.85,145.85,437.54999999999995,25,4,8,"H","E","333IX6SRH FRL",null,null,null,null,null,null,"","","","","","","","","","","","","","","B","x",null,null,null,null,null,"M",null,null,24]
[{"$f":"CONCATENATE(B195,\"|\",C195)","v":"333HFRLSKG2|IX6SR"},"333HFRLSKG2","IX6SR",152.71,152.71,152.71,{"$f":"D195+E195+F195","v":458.13},25,4,8,"H","E","333IX6SRH FRL SKG2    ",null,null,null,null,null,null,"","","","","","","","","","","","","","","B","x",null,null,null,null,null,"M",null,null,25]
["333MH|IX6SR","333MH","IX6SR",163.61000000000001,163.61000000000001,163.61000000000001,490.83000000000004,17,4,0,"H","E","333IX6SRHM","","","","","","","","","","","","","","","","","","","","","B","x",null,null,null,null,null,"M",null,null,27]
["333MHSKG2|IX6SR","333MHSKG2","IX6SR",170.47,170.47,170.47,511.40999999999997,17,4,8,"H","E","333IX6SRHM SKG2   ",null,null,null,null,null,null,null,null,null,null,null,null,null,null,null,null,null,null,null,null,"B",null,null,null,null,null,null,"M",null,null,28]
["333K1|IX6SR","333K1","IX6SR",164.45,164.45,164.45,493.34999999999997,1,1,20,"D","E","333IX6SR","B_KNAUFAUSF","KNK1","","","","","","","","","","","","","","","","","","","B",null,null,null,null,null,null,"M",null,null,36]
["333K1SKG2|IX6SR","333K1SKG2","IX6SR",171.31,171.31,171.31,513.93000000000006,1,1,20,"D","E","333IX6SR SKG2     ","B_KNAUFAUSF","KNK1",null,null,null,null,null,null,null,null,null,null,null,null,null,null,null,null,null,null,"B",null,null,null,null,null,null,"M",null,null,37]
["333K2|IX6SR","333K2","IX6SR",164.45,164.45,164.45,493.34999999999997,1,1,20,"D","E","333IX6SR","B_KNAUFAUSF","KNK2","","","","","","","","","","","","","","","","","","","B",null,null,null,null,null,null,"M",null,null,39]
["333K2SKG2|IX6SR","333K2SKG2","IX6SR",171.31,171.31,171.31,513.93000000000006,1,1,20,"D","E","333IX6SR SKG2     ","B_KNAUFAUSF","KNK2",null,null,null,null,null,null,null,null,null,null,null,null,null,null,null,null,null,null,"B",null,null,null,null,null,"D","M",null,null,40]
["333K3|IX6SR","333K3","IX6SR",164.45,164.45,164.45,493.34999999999997,1,1,20,"D","E","333IX6SR","B_KNAUFAUSF","KNK3",null,null,null,null,null,null,null,null,null,null,null,null,null,null,null,null,null,null,"B",null,null,null,null,null,null,"M",null,null,42]
["333K3SKG2|IX6SR","333K3SKG2","IX6SR",171.31,171.31,171.31,513.93000000000006,1,1,20,"D","E","333IX6SR SKG2     ","B_KNAUFAUSF","KNK3",null,null,null,null,null,null,null,null,null,null,null,null,null,null,null,null,null,null,"B",null,null,null,null,null,null,"M",null,null,43]
["333K4|IX6SR","333K4","IX6SR",164.45,164.45,164.45,493.34999999999997,1,1,0,"D","E","333IX6SR","B_KNAUFAUSF","KNK4",null,null,null,null,null,null,null,null,null,null,null,null,null,null,null,null,null,null,"B",null,null,null,null,null,null,"M",null,null,45]
["333K4SKG2|IX6SR","333K4SKG2","IX6SR",171.31,171.31,171.31,513.93000000000006,1,1,0,"D","E","333IX6SR SKG2     ","B_KNAUFAUSF","KNK4",null,null,null,null,null,null,null,null,null,null,null,null,null,null,null,null,null,null,"B",null,null,null,null,null,null,"M",null,null,46]
["333K6KRU|IX6SR","333K6KRU","IX6SR",181.46,181.46,181.46,544.38,1,1,20,"D","E","333IX6SR KRU","B_KNAUFAUSF","KNK6","","","","","","","","","","","","","","","","","","","B",null,null,null,null,null,null,"M",null,null,50]
["333MK6|IX6SR","333MK6","IX6SR",190.88,190.88,190.88,572.64,3,1,20,"D","E","333IX6SRM","B_KNAUFAUSF","KNK6","","","","","","","","","","","","","","","","","","","B",null,null,null,null,null,null,"M",null,null,51]
["333MK6SKG2|IX6SR","333MK6SKG2","IX6SR",197.74,197.74,197.74,593.22,3,1,20,"D","E","333IX6SRM SKG2     ","B_KNAUFAUSF","KNK6",null,null,null,null,null,null,null,null,null,null,null,null,null,null,null,null,null,null,"B",null,null,null,null,null,null,"M",null,null,52]
["333KL|IX6SR","333KL","IX6SR",158.24,158.24,158.24,474.72,5,1,18,"D","E","333IX6SRKL","","","","","","","","","","","","","","","","","","","","","B","x",null,null,null,null,null,"M",null,null,62]
["333KLT|IX6SR","333KLT","IX6SR",165.7,165.7,165.7,497.09999999999997,5,1,0,"D","E","333IX6SRKL","B_FUNKTIONEN","FUT","","","","","","","","","","","","","","","","","","","B",null,null,null,null,null,null,"M",null,null,65]
["333RI-10|IX6SR","333RI-10","IX6SR",173.86,173.86,173.86,521.58000000000004,1,1,0,"D","E","333IX6SR","B_MITNEHMERAUSF","MIRI10","","","","","","","","","","","","","","","","","","","B",null,null,null,null,null,null,"M",null,null,65.5]
["333RI-14|IX6SR","333RI-14","IX6SR",173.86,173.86,173.86,521.58000000000004,1,1,0,"D","E","333IX6SR","B_MITNEHMERAUSF","MIRI14","","","","","","","","","","","","","","","","","","","B",null,null,null,null,null,null,"M",null,null,65.599999999999994]
["472|IX6SR","472","IX6SR",173.35,173.35,173.35,520.04999999999995,1,1,0,"D","E","2222IX6SR","","","","","","","","","","","","","","","","","","","","","B",null,null,null,null,null,null,"M",null,null,66]
["472H|IX6SR","472H","IX6SR",156.01,156.01,156.01,468.03,4,4,8,"H","E","2222IX6SRH","","","","","","","","","","","","","","","","","","","","","B",null,null,null,null,null,null,"M",null,null,67]
["472K6|IX6SR","472K6","IX6SR",181.98,181.98,181.98,545.93999999999994,1,1,0,"D","E","2222IX6SR","B_KNAUFAUSF","KNK6","","","","","","","","","","","","","","","","","","","B",null,null,null,null,null,"H","M",null,null,68]
["555P|IX6SR","555P","IX6SR",158.24,158.24,158.24,474.72,0,4,0,"H","E","555IX6SR","B_AUSFUEHRUNG_ROHR_PLATTE","RPP","","","","","","","","","","","","","","","","","","","B","x",null,null,null,null,null,"M",null,null,69]
["555PSKG2|IX6SR","555PSKG2","IX6SR",165.1,165.1,165.1,495.29999999999995,0,4,0,"H","E","555IX6SR SKG2     ",null,null,null,null,null,null,null,null,null,null,null,null,null,null,null,null,null,null,null,null,"B",null,null,null,null,null,null,"M",null,null,70]
["325L|IX6SR","325L","IX6SR",135.66,135.66,135.66,406.98,0,1,0,"H","E","325IX6SR","B_AUSFUEHRUNG_325","LIPS",null,null,null,null,null,null,null,null,null,null,null,null,null,null,null,null,null,null,"B",null,null,null,null,null,null,"M",null,null,71]
["325L/1754DR1|IX6SR","325L/1754DR1","IX6SR",327.86,327.86,327.86,983.58,0,1,0,"H","E","325IX6SR","B_AUSFUEHRUNG_325","LIPS",null,null,null,null,null,null,null,null,null,null,null,null,null,null,null,null,null,null,"B",null,null,null,null,null,null,"M",null,null,72]
["325L/1754DR2|IX6SR","325L/1754DR2","IX6SR",327.86,327.86,327.86,983.58,0,1,0,"H","E","325IX6SR","B_AUSFUEHRUNG_325","LIPS",null,null,null,null,null,null,null,null,null,null,null,null,null,null,null,null,null,null,"B",null,null,null,null,null,null,"M",null,null,73]
["325/464|IX6SR","325/464","IX6SR",0,0,0,0,0,0,0,"H","E","325IX6SR3464",null,null,null,null,null,null,null,null,null,null,null,null,null,null,null,null,null,null,null,null,"B",null,null,null,null,null,null,"M",null,null,74]
["777G3|IX6SR","777G3","IX6SR",178.56,178.56,178.56,535.68000000000006,0,0,21,"H","E","777IX6SRG3",null,null,null,null,"","","","","","","","","","","","","","","","","B","x",1,null,null,null,null,"M",null,null,75]
["777G3-HB60|IX6SR","777G3-HB60","IX6SR",190.42,190.42,190.42,571.26,0,0,21,"H","E","777IX6SRG3","B_BUEGELLAENGE","BU60",null,null,"","","","","","","","","","","","","","","","","B","x",1,null,null,null,null,"M",null,null,76]
["382LI|IX6SR","382LI","IX6SR",135.66,135.66,135.66,406.98,0,4,4,"H","E","382IX6SR","B_TEILENR_HEBEL_10_8_BAU","200013F013","B_AUSFUEHRUNG_LI_RE ","AGLI","","","","","","","","","","","","","","","","","B","x",null,null,null,null,null,"M",null,null,78]
["382RE|IX6SR","382RE","IX6SR",135.66,135.66,135.66,406.98,0,4,4,"H","E","382IX6SR","B_TEILENR_HEBEL_10_8_BAU","200013F013","B_AUSFUEHRUNG_LI_RE ","AGRE","","","","","","","","","","","","","","","","","B","x",null,null,null,null,null,"M",null,null,79]
["393|IX6SR","393","IX6SR",173.35,173.35,173.35,520.04999999999995,0,4,5,"H","E","393IX6SR",null,null,"","","","","","","","","","","","","","","","","","","B","x",null,null,null,null,null,"M",null,null,80]
["419 LIPS|IX6SR","419 LIPS","IX6SR",180.83,180.83,180.83,542.49,0,9,0,null,"E","419IX6SR LIPS",null,null,null,null,null,null,null,null,null,null,null,null,null,null,null,null,null,null,null,null,"B",null,null,null,null,null,null,"M",null,null,81]
["|IX6SR",null,"IX6SR",0,0,0,0,0,0,0,null,"E",235271,null,null,null,null,null,null,null,null,null,null,null,null,null,null,null,null,null,null,null,null,"B",null,null,null,null,null,null,"M"]
["333|IXHT","333","IXHT",104.95,104.95,104.95,314.85000000000002,1,1,20,"D","E","333IXHT","","","","","","","","","","","","","","","","","","","","","B","x",null,null,null,null,null,"M",null,null,1]
["333SKG2|IXHT","333SKG2","IXHT",111.81,111.81,111.81,335.43,33,1,20,"D","E","333IXHT SKG2",null,null,null,null,null,null,null,null,null,null,null,null,null,null,null,null,null,null,null,null,"B",null,null,null,null,null,null,"M",null,null,2]
["333H|IXHT","333H","IXHT",94.45,94.45,94.45,283.35000000000002,4,4,8,"H","E","333IXHTH","","","","","","","","","","","","","","","","","","","","","B","x",null,null,null,null,null,"M",null,null,2.1]
["333HSKG2|IXHT","333HSKG2","IXHT",101.31,101.31,101.31,303.93,4,4,8,"H","E","333IXHTH SKG2",null,null,null,null,null,null,null,null,null,null,null,null,null,null,null,null,null,null,null,null,"B",null,null,null,null,null,null,"M",null,null,2.2000000000000002]
["333K6|IXHT","333K6","IXHT",110.18,110.18,110.18,330.54,1,1,20,"D","E","333IXHT","B_KNAUFAUSF","KNK6","","","","","","","","","","","","","","","","","","","B",null,null,null,null,null,null,"M",null,null,2.2999999999999998]
["333K6SKG2|IXHT","333K6SKG2","IXHT",117.04,117.04,117.04,351.12,33,1,20,"D","E","333IXHT SKG2","B_KNAUFAUSF","KNK6",null,null,null,null,null,null,null,null,null,null,null,null,null,null,null,null,null,null,"B",null,null,null,null,null,null,"M",null,null,2.4]
["333T|IXHT","333T","IXHT",112.41,112.41,112.41,337.23,1,1,3,"D","E","333IXHT","B_FUNKTIONEN","FUT","","","","","","","","","","","","","","","","","","","B",null,null,null,null,null,null,"M",null,null,4]
["333TSKG2|IXHT","333TSKG2","IXHT",119.27,119.27,119.27,357.81,33,1,3,"D","E","333IXHT SKG2","B_FUNKTIONEN","FUT",null,null,null,null,null,null,null,null,null,null,null,null,null,null,null,null,null,null,"B",null,null,null,null,null,null,"M",null,null,5]
["333FRL|IXHT","333FRL","IXHT",115.14,115.14,115.14,345.42,24,1,0,"D","E","333IXHT FRL",null,null,"","","","","","","","","","","","","","","","","","","B","x",null,null,null,null,null,"M",null,null,7]
["333FRLSKG2|IXHT","333FRLSKG2","IXHT",122,122,122,366,24,1,0,"D","E","333IXHT FRL SKG2",null,null,null,null,null,null,null,null,null,null,null,null,null,null,null,null,null,null,null,null,"B",null,null,null,null,null,null,"M",null,null,8]
["333M|IXHT","333M","IXHT",132.58000000000001,132.58000000000001,132.58000000000001,397.74,3,1,20,"D","E","333IXHTM","","","","","","","","","","","","","","","","","","","","","B","x",null,null,null,null,null,"M",null,null,12]
["333MSKG2|IXHT","333MSKG2","IXHT",139.44,139.44,139.44,418.32,3,1,20,"D","E","333IXHTM SKG2",null,null,null,null,null,null,null,null,null,null,null,null,null,null,null,null,null,null,null,null,"B",null,null,null,null,null,null,"M",null,null,13]
["333MT|IXHT","333MT","IXHT",140.04,140.04,140.04,420.12,3,1,3,"D","E","333IXHTM","B_FUNKTIONEN","FUT",null,null,null,null,"","","","","","","","","","","","","","","B",null,null,null,null,null,null,"M",null,null,15]
["333HFRL|IXHT","333HFRL","IXHT",104.64,104.64,104.64,313.92,25,4,8,"H","E","333IXHTH FRL",null,null,"","","","","","","","","","","","","","","","","","","B","x",null,null,null,null,null,"M",null,null,24]
["333HFRLSKG2|IXHT","333HFRLSKG2","IXHT",111.5,111.5,111.5,334.5,25,4,8,"H","E","333IXHTH FRL SKG2",null,null,"","","","","","","","","","","","","","","","","","","B","x",null,null,null,null,"D","M",null,null,25]
["333MH|IXHT","333MH","IXHT",119.29,119.29,119.29,357.87,17,4,0,"H","E","333IXHTHM","","","","","","","","","","","","","","","","","","","","","B","x",null,null,null,null,null,"M",null,null,27]
["333MHSKG2|IXHT","333MHSKG2","IXHT",126.15,126.15,126.15,378.45000000000005,17,4,8,"H","E","333IXHTHM SKG2",null,null,null,null,null,null,null,null,null,null,null,null,null,null,null,null,null,null,null,null,"B",null,null,null,null,null,"Halb","M",null,null,28]
["333K1|IXHT","333K1","IXHT",116.39,116.39,116.39,349.17,1,1,20,"D","E","333IXHT","B_KNAUFAUSF","KNK1","","","","","","","","","","","","","","","","","","","B",null,null,null,null,null,null,"M",null,null,36]
["333K1SKG2|IXHT","333K1SKG2","IXHT",123.25,123.25,123.25,369.75,33,1,20,"D","E","333IXHT SKG2","B_KNAUFAUSF","KNK1",null,null,null,null,null,null,null,null,null,null,null,null,null,null,null,null,null,null,"B",null,null,null,null,null,null,"M",null,null,37]
["333K2|IXHT","333K2","IXHT",116.39,116.39,116.39,349.17,1,1,20,"D","E","333IXHT","B_KNAUFAUSF","KNK2","","","","","","","","","","","","","","","","","","","B",null,null,null,null,null,null,"M",null,null,39]
["333K2SKG2|IXHT","333K2SKG2","IXHT",123.25,123.25,123.25,369.75,33,1,20,"D","E","333IXHT SKG2","B_KNAUFAUSF","KNK2",null,null,null,null,null,null,null,null,null,null,null,null,null,null,null,null,null,null,"B",null,null,null,null,null,null,"M",null,null,40]
["333K3|IXHT","333K3","IXHT",116.39,116.39,116.39,349.17,1,1,20,"D","E","333IXHT","B_KNAUFAUSF","KNK3",null,null,null,null,null,null,null,null,null,null,null,null,null,null,null,null,null,null,"B",null,null,null,null,null,null,"M",null,null,42]
["333K3SKG2|IXHT","333K3SKG2","IXHT",123.25,123.25,123.25,369.75,33,1,20,"D","E","333IXHT SKG2","B_KNAUFAUSF","KNK3",null,null,null,null,null,null,null,null,null,null,null,null,null,null,null,null,null,null,"B",null,null,null,null,null,null,"M",null,null,43]
["333K4|IXHT","333K4","IXHT",116.39,116.39,116.39,349.17,1,1,0,"D","E","333IXHT","B_KNAUFAUSF","KNK4",null,null,null,null,null,null,null,null,null,null,null,null,null,null,null,null,null,null,"B",null,null,null,null,null,null,"M",null,null,45]
["333K4SKG2|IXHT","333K4SKG2","IXHT",123.25,123.25,123.25,369.75,33,1,0,"D","E","333IXHT SKG2","B_KNAUFAUSF","KNK4",null,null,null,null,null,null,null,null,null,null,null,null,null,null,null,null,null,null,"B",null,null,null,null,null,null,"M",null,null,46]
["333K7|IXHT","333K7","IXHT",146.49,146.49,146.49,439.47,30,10,0,"D","E","333IXHT K7 SKG2",null,null,"","","","","","","","","","","","","","","","","","","B",null,null,null,null,null,null,"M",null,null,48]
["333K7SKG2|IXHT","333K7SKG2","IXHT",153.35,153.35,153.35,460.04999999999995,30,10,0,"D","E","333IXHT K7 SKG2",null,null,"","","","","","","","","","","","","","","","","","","B",null,null,null,null,null,null,"M",null,null,49]
["333K6KRU|IXHT","333K6KRU","IXHT",133.4,133.4,133.4,400.20000000000005,1,1,20,"D","E","333IXHT KRU","B_KNAUFAUSF","KNK6","","","","","","","","","","","","","","","","","","","B",null,null,null,null,null,null,"M",null,null,50]
["333MK6|IXHT","333MK6","IXHT",139.19,139.19,139.19,417.57,3,1,20,"D","E","333IXHTM","B_KNAUFAUSF","KNK6","","","","","","","","","","","","","","","","","","","B",null,null,null,null,null,null,"M",null,null,51]
["333MK6SKG2|IXHT","333MK6SKG2","IXHT",146.05000000000001,146.05000000000001,146.05000000000001,438.15000000000003,3,1,20,"D","E","333IXHTM SKG2","B_KNAUFAUSF","KNK6",null,null,null,null,null,null,null,null,null,null,null,null,null,null,null,null,null,null,"B",null,null,null,null,null,null,"M",null,null,52]
[{"$f":"CONCATENATE(B259,\"|\",C259)","v":"333MK7|IXHT"},"333MK7","IXHT",182.36,182.36,182.36,{"$f":"D259+E259+F259","v":547.08000000000004},31,10,0,"D","E","333IXHTM K7 SKG2",null,null,"","","","","","","","","","","","","","","","","","","B",null,null,null,null,null,null,"M",null,null,58]
["333MK7SKG2|IXHT","333MK7SKG2","IXHT",189.22,189.22,189.22,567.66,31,10,0,"D","E","333IXHTM K7 SKG2",null,null,"","","","","","","","","","","","","","","","","","","B",null,null,null,null,null,null,"M",null,null,59]
["333KL|IXHT","333KL","IXHT",110.18,110.18,110.18,330.54,5,1,18,"D","E","333IXHTKL","","","","","","","","","","","","","","","","","","","","","B","x",null,null,null,null,null,"M",null,null,62]
["333KLK6|IXHT","333KLK6","IXHT",110.18,110.18,110.18,330.54,5,1,0,"D","E","333IXHTKL","B_KNAUFAUSF","KNK6","","","","","","","","","","","","","","","","","","","B",null,null,null,null,null,null,"M",null,null,63]
["333KLT|IXHT","333KLT","IXHT",117.64,117.64,117.64,352.92,5,1,0,"D","E","333IXHTKL","B_FUNKTIONEN","FUT","","","","","","","","","","","","","","","","","","","B",null,null,null,null,null,null,"M",null,null,65]
["333RI-10|IXHT","333RI-10","IXHT",128.11000000000001,128.11000000000001,128.11000000000001,384.33000000000004,1,1,0,"D","E","333IXHT","B_MITNEHMERAUSF","MIRI10","","","","","","","","","","","","","","","","","","","B",null,null,null,null,null,null,"M",null,null,65.5]
["333RI-14|IXHT","333RI-14","IXHT",128.11000000000001,128.11000000000001,128.11000000000001,384.33000000000004,1,1,0,"D","E","333IXHT","B_MITNEHMERAUSF","MIRI14","","","","","","","","","","","","","","","","","","","B",null,null,null,null,null,null,"M",null,null,65.599999999999994]
["472|IXHT","472","IXHT",113,113,113,339,1,1,0,"D","E","2222IXHT",null,null,null,null,null,null,"","","","","","","","","","","","","","","B",null,null,null,null,null,null,"M",null,null,66]
["472H|IXHT","472H","IXHT",101.71,101.71,101.71,305.13,4,4,8,"H","E","2222IXHTH",null,null,null,null,null,null,"","","","","","","","","","","","","","","B",null,null,null,null,null,null,"M",null,null,67]
["472K6|IXHT","472K6","IXHT",118.68,118.68,118.68,356.04,1,1,0,"D","E","2222IXHT","B_KNAUFAUSF","KNK6",null,null,null,null,"","","","","","","","","","","","","","","B",null,null,null,null,null,null,"M",null,null,68]
["555P|IXHT","555P","IXHT",110.18,110.18,110.18,330.54,0,4,0,"H","E","555IXHT","B_AUSFUEHRUNG_ROHR_PLATTE","RPP","","","","","","","","","","","","","","","","","","","B","x",null,null,null,null,null,"M",null,null,69]
["555PSKG2|IXHT","555PSKG2","IXHT",117.04,117.04,117.04,351.12,0,4,0,"H","E","555IXHT SKG2",null,null,null,null,null,null,null,null,null,null,null,null,null,null,null,null,null,null,null,null,"B",null,null,null,null,null,null,"M",null,null,70]
["325L|IXHT","325L","IXHT",94.45,94.45,94.45,283.35000000000002,0,1,0,"H","E","325IXHT","B_AUSFUEHRUNG_325","LIPS",null,null,null,null,null,null,null,null,null,null,null,null,null,null,null,null,null,null,"B",null,null,null,null,null,null,"M",null,null,71]
["325L/1754DR1|IXHT","325L/1754DR1","IXHT",286.64999999999998,286.64999999999998,286.64999999999998,859.94999999999993,0,1,0,"H","E","325IXHT","B_AUSFUEHRUNG_325","LIPS",null,null,null,null,null,null,null,null,null,null,null,null,null,null,null,null,null,null,"B",null,null,null,null,null,null,"M",null,null,72]
["325L/1754DR2|IXHT","325L/1754DR2","IXHT",286.64999999999998,286.64999999999998,286.64999999999998,859.94999999999993,0,1,0,"H","E","325IXHT","B_AUSFUEHRUNG_325","LIPS",null,null,null,null,null,null,null,null,null,null,null,null,null,null,null,null,null,null,"B",null,null,null,null,null,null,"M",null,null,73]
["325/464|IXHT","325/464","IXHT",94.45,94.45,94.45,283.35000000000002,0,0,0,"H","E","325IXHT3464",null,null,null,null,null,null,null,null,null,null,null,null,null,null,null,null,null,null,null,null,"B",null,null,null,null,null,null,"M",null,null,74]
["777G3|IXHT","777G3","IXHT",137.35,137.35,137.35,412.04999999999995,0,0,21,"H","E","777IXHTG3",null,null,null,null,"","","","","","","","","","","","","","","","","B","x",null,null,null,null,null,"M",null,null,75]
["777G3-HB60|IXHT","777G3-HB60","IXHT",149.21,149.21,149.21,447.63,0,0,21,"H","E","777IXHTG3","B_BUEGELLAENGE","BU60",null,null,"","","","","","","","","","","","","","","","","B","x",null,null,null,null,null,"M",null,null,76]
["777G3-HB120|IXHT","777G3-HB120","IXHT",151.93,151.93,151.93,455.79,0,0,21,"H","E","777IXHTG3","B_BUEGELLAENGE","BU120",null,null,"","","","","","","","","","","","","","","","","B","x",null,null,null,null,null,"M",null,null,77]
["382LI|IXHT","382LI","IXHT",94.45,94.45,94.45,283.35000000000002,0,4,4,"H","E","382IXHT","B_TEILENR_HEBEL_10_8_BAU","200013F013","B_AUSFUEHRUNG_LI_RE","AGLI",null,"","","","","","","","","","","","","","","","B","x",null,null,null,null,null,"M",null,null,78]
["382RE|IXHT","382RE","IXHT",94.45,94.45,94.45,283.35000000000002,0,4,4,"H","E","382IXHT","B_TEILENR_HEBEL_10_8_BAU","200013F013","B_AUSFUEHRUNG_LI_RE","AGRE",null,"","","","","","","","","","","","","","","","B","x",null,null,null,null,null,"M",null,null,79]
["393|IXHT","393","IXHT",120.67,120.67,120.67,362.01,0,4,5,"H","E","393IXHT",null,null,"","","","","","","","","","","","","","","","","","","B","x",null,null,null,null,null,"M",null,null,80]
["419 LIPS|IXHT","419 LIPS","IXHT",125.93,125.93,125.93,377.79,0,9,0,null,"E","419IXHT LIPS",null,null,null,null,null,null,null,null,null,null,null,null,null,null,null,null,null,null,null,null,"B",null,null,null,null,null,null,"M",null,null,81]
["464/325-L|IXHT","464/325-L","IXHT",111.03,111.03,111.03,333.09000000000003,0,4,19,"H","E","3464IXHT","B_AUSFUEHRUNG_LI_RE","AGLI",null,null,null,null,null,null,null,null,null,null,null,null,null,null,null,null,null,null,"B","X",null,null,null,null,null,"M",null,null,82]
["464/325-R|IXHT","464/325-R","IXHT",111.03,111.03,111.03,333.09000000000003,0,4,19,"H","E","3464IXHT","B_AUSFUEHRUNG_LI_RE","AGRE","","","","","","","","","","","","","","","","","","","B","x",null,null,null,null,null,"M",null,null,83]
["3020/473|IXHT","3020/473","IXHT",129,129,129,387,0,0,0,"H","E","3020/473IXHT","B_RUNDMUTTER_3020","217060","B_TNR_FUEHRUNGSDUEBEL_BAUZYL","217128F","B_TNR_SCHLIESSBLECH_BAUZYL","222750 002","B_TNR_WERKZEUG_BAUZYLINDER","204271 002",null,null,null,null,null,null,null,null,null,null,null,null,"B",null,null,null,null,null,null,"M",null,null,84]
["3020/473 ESP|IXHT","3020/473 ESP","IXHT",129,129,129,387,0,0,0,"H","E","3020/473IXHT","B_RUNDMUTTER_3020","217060","B_TNR_DREHSTANGE_BAUZYL","205185 001","B_TNR_ANSCHLAGSTIFT_BAUZYL","207257F002","B_TNR_SCHLIESSHAKEN_BAUZYL","204476F002","B_TNR_SCHLIESSHAKEN_2_BAUZYL","204478F002","B_TNR_SCHLAUFEN_UNTERTEIL","218420F002","B_TNR_SCHLAUFEN_OBERTEIL","218418F002","B_TNR_SCHLIESSBLECH_BAUZYL","222750 002","B_TNR_FUEHRUNGSDUEBEL_BAUZYL","217128F","B_TNR_BUCHSE_DREHSTANGE","218422F036","B",null,null,null,null,null,null,"M",null,null,85]
["3020/4015|IXHT","3020/4015","IXHT",129,129,129,387,0,0,0,"H","E","3020/4015IXHT","B_RUNDMUTTER_3020","217060","B_TNR_FUEHRUNGSDUEBEL_BAUZYL","217128F","B_TNR_SCHLIESSBLECH_BAUZYL","222750 002","B_TNR_WERKZEUG_BAUZYLINDER","204271 002",null,null,null,null,null,null,null,null,null,null,null,null,"B",null,null,null,null,null,null,"M",null,null,86]
["3020/4015 ESP|IXHT","3020/4015 ESP","IXHT",129,129,129,387,0,0,0,"H","E","3020/4015IXHT","B_RUNDMUTTER_3020","217060","B_TNR_DREHSTANGE_BAUZYL","205185 001","B_TNR_ANSCHLAGSTIFT_BAUZYL","207257F002","B_TNR_SCHLIESSHAKEN_BAUZYL","204476F002","B_TNR_SCHLIESSHAKEN_2_BAUZYL","204478F002","B_TNR_SCHLAUFEN_UNTERTEIL","218420F002","B_TNR_SCHLAUFEN_OBERTEIL","218418F002","B_TNR_SCHLIESSBLECH_BAUZYL","222750 002","B_TNR_FUEHRUNGSDUEBEL_BAUZYL","217128F","B_TNR_BUCHSE_DREHSTANGE","218422F036","B",null,null,null,null,null,null,"M",null,null,87]
["|IXHT",null,"IXHT",0,0,0,0,0,0,0,null,"E",235271,null,null,null,null,null,null,null,null,null,null,null,null,null,null,null,null,null,null,null,null,"B",null,null,null,null,null,null,"M"]
["333|IXSAT","333","IXSAT",150.52000000000001,150.52000000000001,150.52000000000001,451.56000000000006,1,1,20,"D","E","333IXSAT",null,null,null,null,null,null,null,null,null,null,null,null,null,null,null,null,null,null,null,null,"B","x",1,null,null,null,null,"M",null,null,1]
["333SKG2|IXSAT","333SKG2","IXSAT",157.38,157.38,157.38,472.14,33,1,20,"D","E","333IXSAT SKG2",null,null,null,null,null,null,null,null,null,null,null,null,null,null,null,null,null,null,null,null,"B",null,null,null,null,null,null,"M",null,null,2]
["333H|IXSAT","333H","IXSAT",135.47999999999999,135.47999999999999,135.47999999999999,406.43999999999994,4,4,8,"H","E","333IXSATH",null,null,null,null,null,null,null,null,null,null,null,null,null,null,null,null,null,null,null,null,"B","x",70,null,null,null,null,"M",null,null,2.1]
["333HSKG2|IXSAT","333HSKG2","IXSAT",142.34,142.34,142.34,427.02,35,4,8,"H","E","333IXSATH SKG2",null,null,null,null,null,null,null,null,null,null,null,null,null,null,null,null,null,null,null,null,"B",null,null,null,null,null,null,"M",null,null,2.2000000000000002]
["333K6|IXSAT","333K6","IXSAT",158.07,158.07,158.07,474.21,1,1,20,"D","E","333IXSAT","B_KNAUFAUSF","KNK6",null,null,null,null,null,null,null,null,null,null,null,null,null,null,null,null,null,null,"B",null,null,null,null,null,null,"M",null,null,2.2999999999999998]
["333K6SKG2|IXSAT","333K6SKG2","IXSAT",164.93,164.93,164.93,494.79,33,1,20,"D","E","333IXSAT SKG2","B_KNAUFAUSF","KNK6",null,null,null,null,null,null,null,null,null,null,null,null,null,null,null,null,null,null,"B",null,null,null,null,null,null,"M",null,null,2.4]
["333T|IXSAT","333T","IXSAT",157.97999999999999,157.97999999999999,157.97999999999999,473.93999999999994,1,1,3,"D","E","333IXSAT","B_FUNKTIONEN","FUT",null,null,null,null,null,null,null,null,null,null,null,null,null,null,null,null,null,null,"B",null,null,null,null,null,null,"M",null,null,4]
["333TSKG2|IXSAT","333TSKG2","IXSAT",164.84,164.84,164.84,494.52,33,1,3,"D","E","333IXSAT SKG2","B_FUNKTIONEN","FUT",null,null,null,null,null,null,null,null,null,null,null,null,null,null,null,null,null,null,"B",null,null,null,null,null,null,"M",null,null,5]
["333FRL|IXSAT","333FRL","IXSAT",160.71,160.71,160.71,482.13,24,1,0,"D","E","333IXSAT FRL",null,null,null,null,null,null,null,null,null,null,null,null,null,null,null,null,null,null,null,null,"B","x",102.1,null,null,null,null,"M",null,null,7]
["333FRLSKG2|IXSAT","333FRLSKG2","IXSAT",167.57,167.57,167.57,502.71,24,1,0,"D","E","333IXSAT FRL SKG2",null,null,null,null,null,null,null,null,null,null,null,null,null,null,null,null,null,null,null,null,"B",null,null,null,null,null,null,"M",null,null,8]
["333M|IXSAT","333M","IXSAT",181.62,181.62,181.62,544.86,3,1,20,"D","E","333IXSATM",null,null,null,null,null,null,null,null,null,null,null,null,null,null,null,null,null,null,null,null,"B","x",null,null,null,null,null,"M",null,null,12]
["333MSKG3|IXSAT","333MSKG3","IXSAT",188.38,188.38,188.38,565.14,3,1,20,"D","E","333IXSATMB SKG3",null,null,null,null,null,null,null,null,null,null,null,null,null,null,null,null,null,null,null,null,"B",null,null,null,null,null,null,"M",null,null,14]
["333MT|IXSAT","333MT","IXSAT",189.08,189.08,189.08,567.24,3,1,3,"D","E","333IXSATM","B_FUNKTIONEN","FUT",null,null,null,null,null,null,null,null,null,null,null,null,null,null,null,null,null,null,"B",null,null,null,null,null,null,"M",null,null,15]
["333HFRL|IXSAT","333HFRL","IXSAT",145.66999999999999,145.66999999999999,145.66999999999999,437.01,25,4,8,"H","E","333IXSATH FRL",null,null,null,null,null,null,null,null,null,null,null,null,null,null,null,null,null,null,null,null,"B","x",70,null,null,null,null,"M",null,null,24]
["333HFRLSKG2|IXSAT","333HFRLSKG2","IXSAT",152.53,152.53,152.53,457.59000000000003,25,4,8,"H","E","333IXSATH FRL SKG2",null,null,null,null,null,null,null,null,null,null,null,null,null,null,null,null,null,null,null,null,"B","x",70,null,null,null,null,"M",null,null,25]
["333MH|IXSAT","333MH","IXSAT",163.44999999999999,163.44999999999999,163.44999999999999,490.34999999999997,17,4,0,"H","E","333IXSATHM",null,null,null,null,null,null,null,null,null,null,null,null,null,null,null,null,null,null,null,null,"B","x",null,null,null,null,"H","M",null,null,27]
["333MHSKG3|IXSAT","333MHSKG3","IXSAT",170.31,170.31,170.31,510.93,17,4,8,"H","E","333IXSATHMB SKG3",null,null,null,null,null,null,null,null,null,null,null,null,null,null,null,null,null,null,null,null,"B",null,null,null,null,null,null,"M",null,null,29]
["333K1|IXSAT","333K1","IXSAT",164.28,164.28,164.28,492.84000000000003,1,1,20,"D","E","333IXSAT","B_KNAUFAUSF","KNK1",null,null,null,null,null,null,null,null,null,null,null,null,null,null,null,null,null,null,"B",null,null,null,null,null,null,"M",null,null,36]
["333K1SKG2|IXSAT","333K1SKG2","IXSAT",171.14,171.14,171.14,513.41999999999996,33,1,20,"D","E","333IXSAT SKG2","B_KNAUFAUSF","KNK1",null,null,null,null,null,null,null,null,null,null,null,null,null,null,null,null,null,null,"B",null,null,null,null,null,null,"M",null,null,37]
["333K2|IXSAT","333K2","IXSAT",164.28,164.28,164.28,492.84000000000003,1,1,20,"D","E","333IXSAT","B_KNAUFAUSF","KNK2",null,null,null,null,null,null,null,null,null,null,null,null,null,null,null,null,null,null,"B",null,null,null,null,null,null,"M",null,null,39]
["333K2SKG2|IXSAT","333K2SKG2","IXSAT",171.14,171.14,171.14,513.41999999999996,33,1,20,"D","E","333IXSAT SKG2","B_KNAUFAUSF","KNK2",null,null,null,null,null,null,null,null,null,null,null,null,null,null,null,null,null,null,"B",null,null,null,null,null,null,"M",null,null,40]
["333K3|IXSAT","333K3","IXSAT",164.28,164.28,164.28,492.84000000000003,1,1,20,"D","E","333IXSAT","B_KNAUFAUSF","KNK3",null,null,null,null,null,null,null,null,null,null,null,null,null,null,null,null,null,null,"B",null,null,null,null,null,null,"M",null,null,42]
["333K3SKG2|IXSAT","333K3SKG2","IXSAT",171.14,171.14,171.14,513.41999999999996,33,1,20,"D","E","333IXSAT SKG2","B_KNAUFAUSF","KNK3",null,null,null,null,null,null,null,null,null,null,null,null,null,null,null,null,null,null,"B",null,null,null,null,null,null,"M",null,null,43]
["333K4|IXSAT","333K4","IXSAT",164.28,164.28,164.28,492.84000000000003,1,1,0,"D","E","333IXSAT","B_KNAUFAUSF","KNK4",null,null,null,null,null,null,null,null,null,null,null,null,null,null,null,null,null,null,"B",null,null,null,null,null,null,"M",null,null,45]
["333K4SKG2|IXSAT","333K4SKG2","IXSAT",171.14,171.14,171.14,513.41999999999996,33,1,0,"D","E","333IXSAT SKG2","B_KNAUFAUSF","KNK4",null,null,null,null,null,null,null,null,null,null,null,null,null,null,null,null,null,null,"B",null,null,null,null,null,null,"M",null,null,46]
["333K7|IXSAT","333K7","IXSAT",194.38,194.38,194.38,583.14,30,10,0,"D","E","333IXSAT K7 SKG2",null,null,"","","","","","","","","","","","","","","","","","","B",null,null,null,null,null,null,"M",null,null,48]
["333K7SKG2|IXSAT","333K7SKG2","IXSAT",201.24,201.24,201.24,603.72,30,10,0,"D","E","333IXSAT K7 SKG2",null,null,"","","","","","","","","","","","","","","","","","","B",null,null,null,null,null,null,"M",null,null,49]
["333K6KRU|IXSAT","333K6KRU","IXSAT",181.29,181.29,181.29,543.87,1,1,20,"D","E","333IXSAT KRU","B_KNAUFAUSF","KNK6",null,null,null,null,null,null,null,null,null,null,null,null,null,null,null,null,null,null,"B",null,null,null,null,null,null,"M",null,null,50]
["333MK6|IXSAT","333MK6","IXSAT",190.68,190.68,190.68,572.04,3,1,20,"D","E","333IXSATM","B_KNAUFAUSF","KNK6",null,null,null,null,null,null,null,null,null,null,null,null,null,null,null,null,null,null,"B",null,null,null,null,null,null,"M",null,null,51]
["333MK6SKG3|IXSAT","333MK6SKG3","IXSAT",197.54,197.54,197.54,592.62,3,1,20,"D","E","333IXSATMB SKG3","B_KNAUFAUSF","KNK6",null,null,null,null,null,null,null,null,null,null,null,null,null,null,null,null,null,null,"B",null,null,null,null,null,null,"M",null,null,53]
["333MK1SKG3|IXSAT","333MK1SKG3","IXSAT",203.75,203.75,203.75,611.25,3,1,20,"D","E","333IXSATMB SKG3","B_KNAUFAUSF","KNK1",null,null,null,null,null,null,null,null,null,null,null,null,null,null,null,null,null,null,"B",null,null,null,null,null,null,"M",null,null,54]
["333MK2SKG3|IXSAT","333MK2SKG3","IXSAT",203.75,203.75,203.75,611.25,3,1,20,"D","E","333IXSATMB SKG3","B_KNAUFAUSF","KNK2",null,null,null,null,null,null,null,null,null,null,null,null,null,null,null,null,null,null,"B",null,null,null,null,null,null,"M",null,null,55]
["333MK3SKG3|IXSAT","333MK3SKG3","IXSAT",203.75,203.75,203.75,611.25,3,1,20,"D","E","333IXSATMB SKG3","B_KNAUFAUSF","KNK3",null,null,null,null,null,null,null,null,null,null,null,null,null,null,null,null,null,null,"B",null,null,null,null,null,null,"M",null,null,56]
["333MK4SKG3|IXSAT","333MK4SKG3","IXSAT",203.75,203.75,203.75,611.25,3,1,0,"D","E","333IXSATMB SKG3","B_KNAUFAUSF","KNK4",null,null,null,null,null,null,null,null,null,null,null,null,null,null,null,null,null,null,"B",null,null,null,null,null,null,"M",null,null,57]
[{"$f":"CONCATENATE(B323,\"|\",C323)","v":"333MK7|IXSAT"},"333MK7","IXSAT",226.99,226.99,226.99,{"$f":"D323+E323+F323","v":680.97},31,10,0,"D","E","333IXSATMB K7 SKG3",null,null,"","","","","","","","","","","","","","","","","","","B",null,null,null,null,null,null,"M",null,null,58]
["333MK7SKG3|IXSAT","333MK7SKG3","IXSAT",233.85,233.85,233.85,701.55,31,10,0,"D","E","333IXSATMB K7 SKG3",null,null,"","","","","","","","","","","","","","","","","","","B",null,null,null,null,null,null,"M",null,null,60]
["333KL|IXSAT","333KL","IXSAT",158.07,158.07,158.07,474.21,5,1,0,"D","E","333IXSATKL",null,null,"","","","","","","","","","","","","","","","","","","B",null,null,null,null,null,null,"M",null,null,62]
["333KLK6|IXSAT","333KLK6","IXSAT",158.07,158.07,158.07,474.21,5,1,0,"D","E","333IXSATKL","B_KNAUFAUSF","KNK6","","","","","","","","","","","","","","","","","","","B",null,null,null,null,null,null,"M",null,null,63]
["333KLT|IXSAT","333KLT","IXSAT",165.53,165.53,165.53,496.59000000000003,5,1,0,"D","E","333IXSATKL","B_FUNKTIONEN","FUT","","","","","","","","","","","","","","","","","","","B",null,null,null,null,null,null,"M",null,null,65]
["333RI-10|IXSAT","333RI-10","IXSAT",173.68,173.68,173.68,521.04,1,1,0,"D","E","333IXSAT","B_MITNEHMERAUSF","MIRI10",null,null,null,null,null,null,null,null,null,null,null,null,null,null,null,null,null,null,"B",null,null,null,null,null,null,"M",null,null,65.5]
["333RI-14|IXSAT","333RI-14","IXSAT",173.68,173.68,173.68,521.04,1,1,0,"D","E","333IXSAT","B_MITNEHMERAUSF","MIRI14",null,null,null,null,null,null,null,null,null,null,null,null,null,null,null,null,null,null,"B",null,null,null,null,null,null,"M",null,null,65.599999999999994]
["472|IXSAT","472","IXSAT",173.1,173.1,173.1,519.29999999999995,26,1,0,"D","E","2222IXSAT","","","","","","","","","","","","","","","","","","","","","B",null,null,null,null,null,null,"M",null,null,66]
["472H|IXSAT","472H","IXSAT",155.77000000000001,155.77000000000001,155.77000000000001,467.31000000000006,27,4,8,"H","E","2222IXSATH","","","","","","","","","","","","","","","","","","","","","B",null,null,null,null,null,null,"M",null,null,67]
["472K6|IXSAT","472K6","IXSAT",181.74,181.74,181.74,545.22,26,1,0,"D","E","2222IXSAT","B_KNAUFAUSF","KNK6","","","","","","","","","","","","","","","","","","","B",null,null,null,null,null,null,"M",null,null,68]
["555P|IXSAT","555P","IXSAT",158.07,158.07,158.07,474.21,0,4,0,"H","E","555IXSAT","B_AUSFUEHRUNG_ROHR_PLATTE","RPP",null,null,null,null,null,null,null,null,null,null,null,null,null,null,null,null,null,null,"B","x",62.2,null,null,null,null,"M",null,null,69]
["555PSKG2|IXSAT","555PSKG2","IXSAT",164.93,164.93,164.93,494.79,0,4,0,"H","E","555IXSAT SKG2",null,null,null,null,null,null,null,null,null,null,null,null,null,null,null,null,null,null,null,null,"B",null,null,null,null,null,null,"M",null,null,70]
["325/464|IXSAT","325/464","IXSAT",0,0,0,0,0,0,0,"H","E","325IXSAT3464",null,null,null,null,null,null,null,null,null,null,null,null,null,null,null,null,null,null,null,null,"B",null,null,null,null,null,null,"M",null,null,74]
["777G3|IXSAT","777G3","IXSAT",178.38,178.38,178.38,535.14,0,0,21,"H","E","777IXSATG3",null,null,null,null,null,null,null,null,null,null,null,null,null,null,null,null,null,null,null,null,"B","x",1,null,null,null,null,"M",null,null,75]
["777G3-HB60|IXSAT","777G3-HB60","IXSAT",190.24,190.24,190.24,570.72,0,0,21,"H","E","777IXSATG3","B_BUEGELLAENGE","BU60",null,null,null,null,null,null,null,null,null,null,null,null,null,null,null,null,null,null,"B","x",1,null,null,null,null,"M",null,null,76]
["777G3-HB120|IXSAT","777G3-HB120","IXSAT",192.96,192.96,192.96,578.88,0,0,21,"H","E","777IXSATG3","B_BUEGELLAENGE","BU120",null,null,null,null,null,null,null,null,null,null,null,null,null,null,null,null,null,null,"B","x",1,null,null,null,null,"M",null,null,77]
["382LI|IXSAT","382LI","IXSAT",135.47999999999999,135.47999999999999,135.47999999999999,406.43999999999994,0,4,4,"H","E","382IXSAT","B_TEILENR_HEBEL_10_8_BAU","200013F013","B_AUSFUEHRUNG_LI_RE","AGLI",null,null,null,null,null,null,null,null,null,null,null,null,null,null,null,null,"B","x",55.4,null,null,null,"D","M",null,null,78]
["382RE|IXSAT","382RE","IXSAT",135.47999999999999,135.47999999999999,135.47999999999999,406.43999999999994,0,4,4,"H","E","382IXSAT","B_TEILENR_HEBEL_10_8_BAU","200013F013","B_AUSFUEHRUNG_LI_RE","AGRE",null,null,null,null,null,null,null,null,null,null,null,null,null,null,null,null,"B","x",55.4,null,null,null,"D","M",null,null,79]
["393|IXSAT","393","IXSAT",202.21,202.21,202.21,606.63,0,4,5,"H","E","393IXSAT",null,null,null,null,null,null,null,null,null,null,null,null,null,null,null,null,null,null,null,null,"B","x",110.6,null,null,null,null,"M",null,null,80]
["464/325-L|IXSAT","464/325-L","IXSAT",158.07,158.07,158.07,474.21,0,4,19,"H","E","3464IXSAT","B_AUSFUEHRUNG_LI_RE","AGLI",null,null,null,null,null,null,null,null,null,null,null,null,null,null,null,null,null,null,"B","X",null,null,null,null,null,"M",null,null,82]
["464/325-R|IXSAT","464/325-R","IXSAT",158.07,158.07,158.07,474.21,0,4,19,"H","E","3464IXSAT","B_AUSFUEHRUNG_LI_RE","AGRE",null,null,null,null,null,null,null,null,null,null,null,null,null,null,null,null,null,null,"B","x",53.1,null,null,null,null,"M",null,null,83]
["|IXSAT",null,"IXSAT",0,0,0,0,0,0,0,null,"E",235271,null,null,null,null,null,null,null,null,null,null,null,null,null,null,null,null,null,null,null,null,"B",null,null,null,null,null,null,"M"]
["333|IXTECO","333","IXTECO",74.3,74.3,74.3,222.89999999999998,1,11,20,"D","N","333IXTECO",null,null,null,null,null,null,null,null,null,null,null,null,null,null,null,null,null,null,null,null,"B","x",1,null,null,null,null,"M",null,null,1]
["333SKG2|IXTECO","333SKG2","IXTECO",81.16,81.16,81.16,243.48,1,11,20,"D","N","333IXTECO SKG2",null,null,null,null,null,null,null,null,null,null,null,null,null,null,null,null,null,null,null,null,"B",null,null,null,null,null,null,"M",null,null,2]
["333H|IXTECO","333H","IXTECO",66.87,66.87,66.87,200.61,4,12,8,"H","N","333IXTECOH",null,null,null,null,null,null,null,null,null,null,null,null,null,null,null,null,null,null,null,null,"B","x",70,null,null,null,null,"M",null,null,2.1]
["333HSKG2|IXTECO","333HSKG2","IXTECO",73.73,73.73,73.73,221.19,4,12,8,"H","N","333IXTECOH SKG2",null,null,null,null,null,null,null,null,null,null,null,null,null,null,null,null,null,null,null,null,"B",null,null,null,null,null,null,"M",null,null,2.2000000000000002]
["333K6|IXTECO","333K6","IXTECO",78.02,78.02,78.02,234.06,1,11,20,"D","N","333IXTECO","B_KNAUFAUSF","KNK6",null,null,null,null,null,null,null,null,null,null,null,null,null,null,null,null,null,null,"B",null,null,null,null,null,null,"M",null,null,2.2999999999999998]
["333K6SKG2|IXTECO","333K6SKG2","IXTECO",84.88,84.88,84.88,254.64,1,11,20,"D","N","333IXTECO SKG2","B_KNAUFAUSF","KNK6",null,null,null,null,null,null,null,null,null,null,null,null,null,null,null,null,null,null,"B",null,null,null,null,null,null,"M",null,null,2.4]
["333T|IXTECO","333T","IXTECO",81.760000000000005,81.760000000000005,81.760000000000005,245.28000000000003,1,11,3,"D","N","333IXTECO","B_FUNKTIONEN","FUT",null,null,null,null,null,null,null,null,null,null,null,null,null,null,null,null,null,null,"B",null,null,null,null,null,null,"M",null,null,4]
["333TSKG2|IXTECO","333TSKG2","IXTECO",89.22,89.22,89.22,267.65999999999997,1,11,3,"D","N","333IXTECO SKG2","B_FUNKTIONEN","FUT",null,null,null,null,null,null,null,null,null,null,null,null,null,null,null,null,null,null,"B",null,null,null,null,null,null,"M",null,null,5]
["333FRL|IXTECO","333FRL","IXTECO",84.49,84.49,84.49,253.46999999999997,24,11,0,"D","N","333IXTECO FRL",null,null,null,null,null,null,null,null,null,null,null,null,null,null,null,null,null,null,null,null,"B","x",102.1,null,null,null,null,"M",null,null,7]
["333FRLSKG2|IXTECO","333FRLSKG2","IXTECO",91.35,91.35,91.35,274.04999999999995,24,11,0,"D","N","333IXTECO FRL SKG2",null,null,null,null,null,null,null,null,null,null,null,null,null,null,null,null,null,null,null,null,"B",null,null,null,null,null,null,"M",null,null,8]
["333M|IXTECO","333M","IXTECO",101.14,101.14,101.14,303.42,3,11,20,"D","N","333IXTECOM",null,null,null,null,null,null,null,null,null,null,null,null,null,null,null,null,null,null,null,null,"B","x",null,null,null,null,null,"M",null,null,12]
["333MSKG3|IXTECO","333MSKG3","IXTECO",108,108,108,324,3,11,20,"D","N","333IXTECOM SKG3",null,null,null,null,null,null,null,null,null,null,null,null,null,null,null,null,null,null,null,null,"B",null,null,null,null,null,null,"M",null,null,14]
["333MT|IXTECO","333MT","IXTECO",108.6,108.6,108.6,325.79999999999995,3,11,3,"D","N","333IXTECOM","B_FUNKTIONEN","FUT",null,null,null,null,null,null,null,null,null,null,null,null,null,null,null,null,null,null,"B",null,null,null,null,null,null,"M",null,null,15]
["333MTSKG3|IXTECO","333MTSKG3","IXTECO",115.46,115.46,115.46,346.38,3,11,3,"D","N","333IXTECOM SKG3","B_FUNKTIONEN","FUT",null,null,null,null,null,null,null,null,null,null,null,null,null,null,null,null,null,null,"B",null,null,null,null,null,null,"M",null,null,16]
["333HFRL|IXTECO","333HFRL","IXTECO",77.06,77.06,77.06,231.18,25,12,8,"H","N","333IXTECOH FRL",null,null,null,null,null,null,null,null,null,null,null,null,null,null,null,null,null,null,null,null,"B","x",70,null,null,null,null,"M",null,null,24]
["333HFRLSKG2|IXTECO","333HFRLSKG2","IXTECO",93.92,93.92,93.92,281.76,25,12,8,"H","N","333IXTECOH FRL SKG2",null,null,null,null,null,null,null,null,null,null,null,null,null,null,null,null,null,null,null,null,"B","x",70,null,null,null,null,"M",null,null,25]
["333MH|IXTECO","333MH","IXTECO",91.02,91.02,91.02,273.06,17,12,0,"H","N","333IXTECOHM",null,null,null,null,null,null,null,null,null,null,null,null,null,null,null,null,null,null,null,null,"B","x",null,null,null,null,null,"M",null,null,27]
["333MHSKG3|IXTECO","333MHSKG3","IXTECO",97.88,97.88,97.88,293.64,17,12,8,"H","N","333IXTECOHM SKG3",null,null,null,null,null,null,null,null,null,null,null,null,null,null,null,null,null,null,null,null,"B",null,null,null,null,null,null,"M",null,null,29]
["333K1|IXTECO","333K1","IXTECO",84.23,84.23,84.23,252.69,1,11,20,"D","N","333IXTECO","B_KNAUFAUSF","KNK1",null,null,null,null,null,null,null,null,null,null,null,null,null,null,null,null,null,null,"B",null,null,null,null,null,null,"M",null,null,36]
["333K1SKG2|IXTECO","333K1SKG2","IXTECO",91.09,91.09,91.09,273.27,1,11,20,"D","N","333IXTECO SKG2","B_KNAUFAUSF","KNK1",null,null,null,null,null,null,null,null,null,null,null,null,null,null,null,null,null,null,"B",null,null,null,null,null,null,"M",null,null,37]
["333K2|IXTECO","333K2","IXTECO",84.23,84.23,84.23,252.69,1,11,20,"D","N","333IXTECO","B_KNAUFAUSF","KNK2",null,null,null,null,null,null,null,null,null,null,null,null,null,null,null,null,null,null,"B",null,null,null,null,null,null,"M",null,null,39]
["333K2SKG2|IXTECO","333K2SKG2","IXTECO",91.09,91.09,91.09,273.27,1,11,20,"D","N","333IXTECO SKG2","B_KNAUFAUSF","KNK2",null,null,null,null,null,null,null,null,null,null,null,null,null,null,null,null,null,null,"B",null,null,null,null,null,null,"M",null,null,40]
["333K3|IXTECO","333K3","IXTECO",84.23,84.23,84.23,252.69,1,11,20,"D","N","333IXTECO","B_KNAUFAUSF","KNK3",null,null,null,null,null,null,null,null,null,null,null,null,null,null,null,null,null,null,"B",null,null,null,null,null,null,"M",null,null,42]
["333K3SKG2|IXTECO","333K3SKG2","IXTECO",91.09,91.09,91.09,273.27,1,11,20,"D","N","333IXTECO SKG2","B_KNAUFAUSF","KNK3",null,null,null,null,null,null,null,null,null,null,null,null,null,null,null,null,null,null,"B",null,null,null,null,null,null,"M",null,null,43]
["333K4|IXTECO","333K4","IXTECO",84.23,84.23,84.23,252.69,1,11,0,"D","N","333IXTECO","B_KNAUFAUSF","KNK4",null,null,null,null,null,null,null,null,null,null,null,null,null,null,null,null,null,null,"B",null,null,null,null,null,null,"M",null,null,45]
["333K4SKG2|IXTECO","333K4SKG2","IXTECO",91.09,91.09,91.09,273.27,1,11,0,"D","N","333IXTECO SKG2","B_KNAUFAUSF","KNK4",null,null,null,null,null,null,null,null,null,null,null,null,null,null,null,null,null,null,"B",null,null,null,null,null,null,"M",null,null,46]
["333K7|IXTECO","333K7","IXTECO",0,0,0,0,30,10,0,"D","N","333IXTECO K7 SKG2",null,null,"","","","","","","","","","","","","","","","","","","B",null,null,null,null,null,null,"M",null,null,48]
["333K7SKG2|IXTECO","333K7SKG2","IXTECO",0,0,0,0,30,10,0,"D","N","333IXTECO K7 SKG2",null,null,"","","","","","","","","","","","","","","","","","","B",null,null,null,null,null,null,"M",null,null,49]
["333K6KRU|IXTECO","333K6KRU","IXTECO",101.24,101.24,101.24,303.71999999999997,1,11,20,"D","N","333IXTECO KRU","B_KNAUFAUSF","KNK6",null,null,null,null,null,null,null,null,null,null,null,null,null,null,null,null,null,null,"B",null,null,null,null,null,null,"M",null,null,50]
["333MK6|IXTECO","333MK6","IXTECO",106.19,106.19,106.19,318.57,3,11,20,"D","N","333IXTECOM","B_KNAUFAUSF","KNK6",null,null,null,null,null,null,null,null,null,null,null,null,null,null,null,null,null,null,"B",null,null,null,null,null,null,"M",null,null,51]
["333MK6SKG3|IXTECO","333MK6SKG3","IXTECO",113.05,113.05,113.05,339.15,3,11,20,"D","N","333IXTECOM SKG3","B_KNAUFAUSF","KNK6",null,null,null,null,null,null,null,null,null,null,null,null,null,null,null,null,null,null,"B",null,null,null,null,null,null,"M",null,null,53]
["333MK1SKG3|IXTECO","333MK1SKG3","IXTECO",119.26,119.26,119.26,357.78000000000003,3,11,20,"D","N","333IXTECOM SKG3","B_KNAUFAUSF","KNK1",null,null,null,null,null,null,null,null,null,null,null,null,null,null,null,null,null,null,"B",null,null,null,null,null,null,"M",null,null,54]
["333MK2SKG3|IXTECO","333MK2SKG3","IXTECO",119.26,119.26,119.26,357.78000000000003,3,11,20,"D","N","333IXTECOM SKG3","B_KNAUFAUSF","KNK2",null,null,null,null,null,null,null,null,null,null,null,null,null,null,null,null,null,null,"B",null,null,null,null,null,null,"M",null,null,55]
["333MK3SKG3|IXTECO","333MK3SKG3","IXTECO",119.26,119.26,119.26,357.78000000000003,3,11,20,"D","N","333IXTECOM SKG3","B_KNAUFAUSF","KNK3",null,null,null,null,null,null,null,null,null,null,null,null,null,null,null,null,null,null,"B",null,null,null,null,null,null,"M",null,null,56]
["333MK4SKG3|IXTECO","333MK4SKG3","IXTECO",116.26,116.26,116.26,348.78000000000003,3,11,0,"D","N","333IXTECOM SKG3","B_KNAUFAUSF","KNK4",null,null,null,null,null,null,null,null,null,null,null,null,null,null,null,null,null,null,"B",null,null,null,null,null,null,"M",null,null,57]
["333MK7|IXTECO","333MK7","IXTECO",0,0,0,0,31,10,0,"D","N","333IXTECOM K7 SKG3",null,null,"","","","","","","","","","","","","","","","","","","B",null,null,null,null,null,null,"M",null,null,58]
["333KL|IXTECO","333KL","IXTECO",78.02,78.02,78.02,234.06,5,1,0,"D","N","333IXTECOKL",null,null,"","","","","","","","","","","","","","","","","","","B",null,null,null,null,null,null,"M",null,null,62]
["333KLK6|IXTECO","333KLK6","IXTECO",78.02,78.02,78.02,234.06,5,1,0,"D","N","333IXTECOKL","B_KNAUFAUSF","KNK6","","","","","","","","","","","","","","","","","","","B",null,null,null,null,null,null,"M",null,null,63]
["333KLT|IXTECO","333KLT","IXTECO",85.48,85.48,85.48,256.44,5,1,0,"D","N","333IXTECOKL","B_FUNKTIONEN","FUT","","","","","","","","","","","","","","","","","","","B",null,null,null,null,null,null,"M",null,null,65]
["333RI-10|IXTECO","333RI-10","IXTECO",97.46,97.46,97.46,292.38,1,11,0,"D","N","333IXTECO","B_MITNEHMERAUSF","MIRI10",null,null,null,null,null,null,null,null,null,null,null,null,null,null,null,null,null,null,"B",null,null,null,null,null,null,"M",null,null,65.5]
["333RI-14|IXTECO","333RI-14","IXTECO",97.46,97.46,97.46,292.38,1,11,0,"D","N","333IXTECO","B_MITNEHMERAUSF","MIRI14",null,null,null,null,null,null,null,null,null,null,null,null,null,null,null,null,null,null,"B",null,null,null,null,null,null,"M",null,null,65.599999999999994]
["472|IXTECO","472","IXTECO",85.45,85.45,85.45,256.35000000000002,1,1,0,"D","N","2222IXTECO",null,null,null,null,null,null,"","","","","","","","","","","","","","","B",null,null,null,null,null,null,"M",null,null,66]
[{"$f":"CONCATENATE(B387,\"|\",C387)","v":"472H|IXTECO"},"472H","IXTECO",76.900000000000006,76.900000000000006,76.900000000000006,{"$f":"D387+E387+F387","v":230.70000000000002},4,4,8,"H","N","2222IXTECOH",null,null,null,null,null,null,"","","","","","","","","","","","","","","B",null,null,null,null,null,null,"M",null,null,67]
["472K6|IXTECO","472K6","IXTECO",89.72,89.72,89.72,269.15999999999997,1,1,0,"D","N","2222IXTECO","B_KNAUFAUSF","KNK6",null,null,null,null,"","","","","","","","","","","","","","","B",null,null,null,null,null,null,"M",null,null,68]
["555P|IXTECO","555P","IXTECO",78.02,78.02,78.02,234.06,0,12,0,"H","N","555IXTECO","B_AUSFUEHRUNG_ROHR_PLATTE","RPP",null,null,null,null,null,null,null,null,null,null,null,null,null,null,null,null,null,null,"B","x",62.2,null,null,null,null,"M",null,null,69]
["555PSKG2|IXTECO","555PSKG2","IXTECO",84.88,84.88,84.88,234.06,0,12,0,"H","N","555IXTECO SKG2","B_AUSFUEHRUNG_ROHR_PLATTE","RPP",null,null,null,null,null,null,null,null,null,null,null,null,null,null,null,null,null,null,"B","x",62.2,null,null,null,null,"M",null,null,69.099999999999994]
["325L|IXTECO","325L","IXTECO",66.87,66.87,66.87,{"$f":"D391+E391+F391","v":200.61},0,12,0,"H","N","325IXTECO","B_AUSFUEHRUNG_325","LIPS",null,null,null,null,null,null,null,null,null,null,null,null,null,null,null,null,null,null,"B",null,null,null,null,null,null,"M",null,null,71]
["325L/1754DR1|IXTECO","325L/1754DR1","IXTECO",259.07,259.07,259.07,777.21,0,12,0,"H","N","325IXTECO","B_AUSFUEHRUNG_325","LIPS",null,null,null,null,null,null,null,null,null,null,null,null,null,null,null,null,null,null,"B",null,null,null,null,null,null,"M",null,null,72]
["325L/1754DR2|IXTECO","325L/1754DR2","IXTECO",259.07,259.07,259.07,777.21,0,12,0,"H","N","325IXTECO","B_AUSFUEHRUNG_325","LIPS",null,null,null,null,null,null,null,null,null,null,null,null,null,null,null,null,null,null,"B",null,null,null,null,null,null,"M",null,null,73]
["325/464|IXTECO","325/464","IXTECO",0,0,0,0,0,0,0,"H","N","325IXTECO3464",null,null,null,null,null,null,null,null,null,null,null,null,null,null,null,null,null,null,null,null,"B",null,null,null,null,null,null,"M",null,null,74]
["777G3|IXTECO","777G3","IXTECO",108.15,108.15,108.15,324.45000000000005,0,0,21,"H","N","777IXTECOG3",null,null,null,null,null,null,null,null,null,null,null,null,null,null,null,null,null,null,null,null,"B","x",1,null,null,null,null,"M",null,null,75]
["777G3-HB60|IXTECO","777G3-HB60","IXTECO",120.01,120.01,120.01,360.03000000000003,0,0,21,"H","N","777IXTECOG3","B_BUEGELLAENGE","BU60",null,null,null,null,null,null,null,null,null,null,null,null,null,null,null,null,null,null,"B","x",1,null,null,null,null,"M",null,null,76]
["777G3-HB120|IXTECO","777G3-HB120","IXTECO",122.73,122.73,122.73,368.19,0,0,21,"H","N","777IXTECOG3","B_BUEGELLAENGE","BU120",null,null,null,null,null,null,null,null,null,null,null,null,null,null,null,null,null,null,"B","x",1,null,null,null,null,"M",null,null,77]
["382LI|IXTECO","382LI","IXTECO",66.87,66.87,66.87,200.61,0,12,4,"H","N","382IXTECO","B_TEILENR_HEBEL_10_8_BAU","200013F013","B_AUSFUEHRUNG_LI_RE","AGLI",null,null,null,null,null,null,null,null,null,null,null,null,null,null,null,null,"B","x",55.4,null,null,null,null,"M",null,null,78]
["382RE|IXTECO","382RE","IXTECO",66.87,66.87,66.87,200.61,0,12,4,"H","N","382IXTECO","B_TEILENR_HEBEL_10_8_BAU","200013F013","B_AUSFUEHRUNG_LI_RE","AGRE",null,null,null,null,null,null,null,null,null,null,null,null,null,null,null,null,"B","x",55.4,null,null,null,null,"M",null,null,79]
["393|IXTECO","393","IXTECO",85.45,85.45,85.45,256.35000000000002,0,4,5,"H","N","393IXTECO",null,null,null,null,null,null,null,null,null,null,null,null,null,null,null,null,null,null,null,null,"B","x",110.6,null,null,null,null,"M",null,null,80]
["3020/473|IXTECO","3020/473","IXTECO",118.68,118.68,118.68,356.04,0,0,0,"H","N","3020/473IXTECO","B_RUNDMUTTER_3020","217060","B_TNR_FUEHRUNGSDUEBEL_BAUZYL","217128F","B_TNR_SCHLIESSBLECH_BAUZYL","222750 002","B_TNR_WERKZEUG_BAUZYLINDER","204271 002",null,null,null,null,null,null,null,null,null,null,null,null,"B",null,null,null,null,null,null,"M",null,null,84]
["3020/473 ESP|IXTECO","3020/473 ESP","IXTECO",118.68,118.68,118.68,356.04,0,0,0,"H","N","3020/473IXTECO","B_RUNDMUTTER_3020","217060","B_TNR_DREHSTANGE_BAUZYL","205185 001","B_TNR_ANSCHLAGSTIFT_BAUZYL","207257F002","B_TNR_SCHLIESSHAKEN_BAUZYL","204476F002","B_TNR_SCHLIESSHAKEN_2_BAUZYL","204478F002","B_TNR_SCHLAUFEN_UNTERTEIL","218420F002","B_TNR_SCHLAUFEN_OBERTEIL","218418F002","B_TNR_SCHLIESSBLECH_BAUZYL","222750 002","B_TNR_FUEHRUNGSDUEBEL_BAUZYL","217128F","B_TNR_BUCHSE_DREHSTANGE","218422F036","B",null,null,null,null,null,null,"M",null,null,85]
["3020/4015|IXTECO","3020/4015","IXTECO",118.68,118.68,118.68,356.04,0,0,0,"H","N","3020/4015IXTECO","B_RUNDMUTTER_3020","217060","B_TNR_FUEHRUNGSDUEBEL_BAUZYL","217128F","B_TNR_SCHLIESSBLECH_BAUZYL","222750 002","B_TNR_WERKZEUG_BAUZYLINDER","204271 002",null,null,null,null,null,null,null,null,null,null,null,null,"B",null,null,null,null,null,null,"M",null,null,86]
["3020/4015 ESP|IXTECO","3020/4015 ESP","IXTECO",118.68,118.68,118.68,356.04,0,0,0,"H","N","3020/4015IXTECO","B_RUNDMUTTER_3020","217060","B_TNR_DREHSTANGE_BAUZYL","205185 001","B_TNR_ANSCHLAGSTIFT_BAUZYL","207257F002","B_TNR_SCHLIESSHAKEN_BAUZYL","204476F002","B_TNR_SCHLIESSHAKEN_2_BAUZYL","204478F002","B_TNR_SCHLAUFEN_UNTERTEIL","218420F002","B_TNR_SCHLAUFEN_OBERTEIL","218418F002","B_TNR_SCHLIESSBLECH_BAUZYL","222750 002","B_TNR_FUEHRUNGSDUEBEL_BAUZYL","217128F","B_TNR_BUCHSE_DREHSTANGE","218422F036","B",null,null,null,null,null,null,"M",null,null,87]
["|IXTECO",null,"IXTECO",0,0,0,0,0,0,0,"H","N",235271,null,null,null,null,null,null,null,null,null,null,null,null,null,null,null,null,null,null,null,null,"B",null,null,null,null,null,null,"M"]
["333|IXTWIDO","333","IXTWIDO",98.04,98.04,98.04,294.12,1,11,20,"D","N","333IXTWIDO",null,null,null,null,null,null,null,null,null,null,null,null,null,null,null,null,null,null,null,null,"B","x",1,null,null,null,null,"M",null,null,1]
["333SKG2|IXTWIDO","333SKG2","IXTWIDO",104.9,104.9,104.9,314.70000000000005,1,11,20,"D","N","333IXTWIDO SKG2",null,null,null,null,null,null,null,null,null,null,null,null,null,null,null,null,null,null,null,null,"B",null,null,null,null,null,null,"M",null,null,2]
["333SKG3|IXTWIDO","333SKG3","IXTWIDO",115.22,115.22,115.22,304.95000000000005,1,11,20,"D","N","333IXTWIDO SKG3",null,null,null,null,null,null,null,null,null,null,null,null,null,null,null,null,null,null,null,null,"B",null,null,null,null,null,null,"M",null,null,2]
["333H|IXTWIDO","333H","IXTWIDO",88.24,88.24,88.24,{"$f":"D409+E409+F409","v":264.71999999999997},4,12,8,"H","N","333IXTWIDOH",null,null,null,null,null,null,null,null,null,null,null,null,null,null,null,null,null,null,null,null,"B","x",70,null,null,null,null,"M",null,null,2.1]
["333HSKG2|IXTWIDO","333HSKG2","IXTWIDO",95.1,95.1,95.1,{"$f":"D410+E410+F410","v":285.29999999999995},4,12,8,"H","N","333IXTWIDOH SKG2",null,null,null,null,null,null,null,null,null,null,null,null,null,null,null,null,null,null,null,null,"B",null,null,null,null,null,null,"M",null,null,2.2000000000000002]
["333HSKG3|IXTWIDO","333HSKG3","IXTWIDO",105.42,105.42,105.42,276.45000000000005,4,12,8,"H","N","333IXTWIDOH SKG3",null,null,null,null,null,null,null,null,null,null,null,null,null,null,null,null,null,null,null,null,"B",null,null,null,null,null,null,"M",null,null,2.2000000000000002]
["333K6|IXTWIDO","333K6","IXTWIDO",102.94,102.94,102.94,{"$f":"D412+E412+F412","v":308.82},1,11,20,"D","N","333IXTWIDO","B_KNAUFAUSF","KNK6",null,null,null,null,null,null,null,null,null,null,null,null,null,null,null,null,null,null,"B",null,null,null,null,null,null,"M",null,null,2.2999999999999998]
["333K6SKG2|IXTWIDO","333K6SKG2","IXTWIDO",109.8,109.8,109.8,{"$f":"D413+E413+F413","v":329.4},1,11,20,"D","N","333IXTWIDO SKG2","B_KNAUFAUSF","KNK6",null,null,null,null,null,null,null,null,null,null,null,null,null,null,null,null,null,null,"B",null,null,null,null,null,null,"M",null,null,2.4]
["333K6SKG3|IXTWIDO","333K6SKG3","IXTWIDO",120.12,120.12,120.12,319.20000000000005,1,11,20,"D","N","333IXTWIDO SKG3","B_KNAUFAUSF","KNK6",null,null,null,null,null,null,null,null,null,null,null,null,null,null,null,null,null,null,"B",null,null,null,null,null,null,"M",null,null,2.4]
["333T|IXTWIDO","333T","IXTWIDO",105.5,105.5,105.5,{"$f":"D415+E415+F415","v":316.5},1,11,3,"D","N","333IXTWIDO","B_FUNKTIONEN","FUT",null,null,null,null,null,null,null,null,null,null,null,null,null,null,null,null,null,null,"B",null,null,null,null,null,null,"M",null,null,4]
["333TSKG2|IXTWIDO","333TSKG2","IXTWIDO",112.36,112.36,112.36,{"$f":"D416+E416+F416","v":337.08},1,11,3,"D","N","333IXTWIDO SKG2","B_FUNKTIONEN","FUT",null,null,null,null,null,null,null,null,null,null,null,null,null,null,null,null,null,null,"B",null,null,null,null,null,null,"M",null,null,5]
["333TSKG3|IXTWIDO","333TSKG3","IXTWIDO",122.68,122.68,122.68,326.64,1,11,3,"D","N","333IXTWIDO SKG3","B_FUNKTIONEN","FUT",null,null,null,null,null,null,null,null,null,null,null,null,null,null,null,null,null,null,"B",null,null,null,null,null,null,"M",null,null,5]
["333FRL|IXTWIDO","333FRL","IXTWIDO",108.23,108.23,108.23,{"$f":"D418+E418+F418","v":324.69},24,11,0,"D","N","333IXTWIDO FRL",null,null,null,null,null,null,null,null,null,null,null,null,null,null,null,null,null,null,null,null,"B","x",102.1,null,null,null,null,"M",null,null,7]
["333FRLSKG2|IXTWIDO","333FRLSKG2","IXTWIDO",115.09,115.09,115.09,{"$f":"D419+E419+F419","v":345.27},24,11,0,"D","N","333IXTWIDO FRL SKG2",null,null,null,null,null,null,null,null,null,null,null,null,null,null,null,null,null,null,null,null,"B",null,null,null,null,null,null,"M",null,null,8]
["333FRLSKG3|IXTWIDO","333FRLSKG3","IXTWIDO",125.41,125.41,125.41,334.56,24,11,0,"D","N","333IXTWIDOFRL SKG3",null,null,null,null,null,null,null,null,null,null,null,null,null,null,null,null,null,null,null,null,"B",null,null,null,null,null,null,"M",null,null,8]
["333M|IXTWIDO","333M","IXTWIDO",124.87,124.87,124.87,{"$f":"D421+E421+F421","v":374.61},3,11,20,"D","N","333IXTWIDOM",null,null,null,null,null,null,null,null,null,null,null,null,null,null,null,null,null,null,null,null,"B","x",null,null,null,null,null,"M",null,null,12]
["333MSKG3|IXTWIDO","333MSKG3","IXTWIDO",131.72999999999999,131.72999999999999,131.72999999999999,395.18999999999994,3,11,20,"D","N","333IXTWIDOM SKG3",null,null,null,null,null,null,null,null,null,null,null,null,null,null,null,null,null,null,null,null,"B",null,null,null,null,null,null,"M",null,null,14]
["333MT|IXTWIDO","333MT","IXTWIDO",132.33000000000001,132.33000000000001,132.33000000000001,396.99,3,11,3,"D","N","333IXTWIDOM","B_FUNKTIONEN","FUT",null,null,null,null,null,null,null,null,null,null,null,null,null,null,null,null,null,null,"B",null,null,null,null,null,null,"M",null,null,15]
["333MTSKG3|IXTWIDO","333MTSKG3","IXTWIDO",139.19,139.19,139.19,417.57,3,11,3,"D","N","333IXTWIDOM SKG3","B_FUNKTIONEN","FUT",null,null,null,null,null,null,null,null,null,null,null,null,null,null,null,null,null,null,"B",null,null,null,null,null,null,"M",null,null,16]
["333HFRL|IXTWIDO","333HFRL","IXTWIDO",98.43,98.43,98.43,295.29000000000002,25,12,8,"H","N","333IXTWIDOH FRL",null,null,null,null,null,null,null,null,null,null,null,null,null,null,null,null,null,null,null,null,"B","x",70,null,null,null,null,"M",null,null,24]
["333HFRLSKG2|IXTWIDO","333HFRLSKG2","IXTWIDO",105.29,105.29,105.29,315.87,25,12,8,"H","N","333IXTWIDOH FRL SKG2",null,null,null,null,null,null,null,null,null,null,null,null,null,null,null,null,null,null,null,null,"B","x",70,null,null,null,null,"M",null,null,25]
["333HFRLSKG3|IXTWIDO","333HFRLSKG3","IXTWIDO",115.61,115.61,115.61,306.06,25,12,8,"H","N","333IXTWIDOHFRLSKG3",null,null,null,null,null,null,null,null,null,null,null,null,null,null,null,null,null,null,null,null,"B","x",70,null,null,null,null,"M",null,null,25]
["333MH|IXTWIDO","333MH","IXTWIDO",112.38,112.38,112.38,{"$f":"D428+E428+F428","v":337.14},17,12,0,"H","N","333IXTWIDOHM",null,null,null,null,null,null,null,null,null,null,null,null,null,null,null,null,null,null,null,null,"B","x",null,null,null,null,null,"M",null,null,27]
["333MHSKG3|IXTWIDO","333MHSKG3","IXTWIDO",119.24,119.24,119.24,{"$f":"D429+E429+F429","v":357.71999999999997},17,12,8,"H","N","333IXTWIDOHM SKG3",null,null,null,null,null,null,null,null,null,null,null,null,null,null,null,null,null,null,null,null,"B",null,null,null,null,null,null,"M",null,null,29]
["333K1|IXTWIDO","333K1","IXTWIDO",109.15,109.15,109.15,{"$f":"D430+E430+F430","v":327.45000000000005},1,11,20,"D","N","333IXTWIDO","B_KNAUFAUSF","KNK1",null,null,null,null,null,null,null,null,null,null,null,null,null,null,null,null,null,null,"B",null,null,null,null,null,null,"M",null,null,36]
["333K1SKG2|IXTWIDO","333K1SKG2","IXTWIDO",116.01,116.01,116.01,{"$f":"D431+E431+F431","v":348.03000000000003},1,11,20,"D","N","333IXTWIDO SKG2","B_KNAUFAUSF","KNK1",null,null,null,null,null,null,null,null,null,null,null,null,null,null,null,null,null,null,"B",null,null,null,null,null,null,"M",null,null,37]
["333K1SKG3|IXTWIDO","333K1SKG3","IXTWIDO",126.33,126.33,126.33,337.26,1,11,20,"D","N","333IXTWIDO SKG3","B_KNAUFAUSF","KNK1",null,null,null,null,null,null,null,null,null,null,null,null,null,null,null,null,null,null,"B",null,null,null,null,null,null,"M",null,null,37]
["333K2|IXTWIDO","333K2","IXTWIDO",109.15,109.15,109.15,{"$f":"D433+E433+F433","v":327.45000000000005},1,11,20,"D","N","333IXTWIDO","B_KNAUFAUSF","KNK2",null,null,null,null,null,null,null,null,null,null,null,null,null,null,null,null,null,null,"B",null,null,null,null,null,null,"M",null,null,39]
["333K2SKG2|IXTWIDO","333K2SKG2","IXTWIDO",116.01,116.01,116.01,{"$f":"D434+E434+F434","v":348.03000000000003},1,11,20,"D","N","333IXTWIDO SKG2","B_KNAUFAUSF","KNK2",null,null,null,null,null,null,null,null,null,null,null,null,null,null,null,null,null,null,"B",null,null,null,null,null,null,"M",null,null,40]
["333K2SKG3|IXTWIDO","333K2SKG3","IXTWIDO",126.33,126.33,126.33,337.26,1,11,20,"D","N","333IXTWIDO SKG3","B_KNAUFAUSF","KNK2",null,null,null,null,null,null,null,null,null,null,null,null,null,null,null,null,null,null,"B",null,null,null,null,null,null,"M",null,null,40]
["333K3|IXTWIDO","333K3","IXTWIDO",109.15,109.15,109.15,{"$f":"D436+E436+F436","v":327.45000000000005},1,11,20,"D","N","333IXTWIDO","B_KNAUFAUSF","KNK3",null,null,null,null,null,null,null,null,null,null,null,null,null,null,null,null,null,null,"B",null,null,null,null,null,null,"M",null,null,42]
["333K3SKG2|IXTWIDO","333K3SKG2","IXTWIDO",116.01,116.01,116.01,{"$f":"D437+E437+F437","v":348.03000000000003},1,11,20,"D","N","333IXTWIDO SKG2","B_KNAUFAUSF","KNK3",null,null,null,null,null,null,null,null,null,null,null,null,null,null,null,null,null,null,"B",null,null,null,null,null,null,"M",null,null,43]
["333K3SKG3|IXTWIDO","333K3SKG3","IXTWIDO",126.33,126.33,126.33,337.26,1,11,20,"D","N","333IXTWIDO SKG3","B_KNAUFAUSF","KNK3",null,null,null,null,null,null,null,null,null,null,null,null,null,null,null,null,null,null,"B",null,null,null,null,null,null,"M",null,null,43]
["333K4|IXTWIDO","333K4","IXTWIDO",109.15,109.15,109.15,{"$f":"D439+E439+F439","v":327.45000000000005},1,11,0,"D","N","333IXTWIDO","B_KNAUFAUSF","KNK4",null,null,null,null,null,null,null,null,null,null,null,null,null,null,null,null,null,null,"B",null,null,null,null,null,null,"M",null,null,45]
["333K4SKG2|IXTWIDO","333K4SKG2","IXTWIDO",116.01,116.01,116.01,{"$f":"D440+E440+F440","v":348.03000000000003},1,11,0,"D","N","333IXTWIDO SKG2","B_KNAUFAUSF","KNK4",null,null,null,null,null,null,null,null,null,null,null,null,null,null,null,null,null,null,"B",null,null,null,null,null,null,"M",null,null,46]
["333K4SKG3|IXTWIDO","333K4SKG3","IXTWIDO",126.33,126.33,126.33,337.26,1,11,0,"D","N","333IXTWIDO SKG3","B_KNAUFAUSF","KNK4",null,null,null,null,null,null,null,null,null,null,null,null,null,null,null,null,null,null,"B",null,null,null,null,null,null,"M",null,null,46]
["333K7|IXTWIDO","333K7","IXTWIDO",139.25,139.25,139.25,{"$f":"D442+E442+F442","v":417.75},30,10,0,"D","N","333IXTWIDO K7 SKG2",null,null,"","","","","","","","","","","","","","","","","","","B",null,null,null,null,null,null,"M",null,null,48]
["333K7SKG2|IXTWIDO","333K7SKG2","IXTWIDO",146.11000000000001,146.11000000000001,146.11000000000001,438.33000000000004,30,10,0,"D","N","333IXTWIDO K7 SKG2",null,null,"","","","","","","","","","","","","","","","","","","B",null,null,null,null,null,null,"M",null,null,49]
["333K6KRU|IXTWIDO","333K6KRU","IXTWIDO",126.16,126.16,126.16,378.48,1,11,20,"D","N","333IXTWIDO KRU","B_KNAUFAUSF","KNK6",null,null,null,null,null,null,null,null,null,null,null,null,null,null,null,null,null,null,"B",null,null,null,null,null,null,"M",null,null,50]
["333MK6|IXTWIDO","333MK6","IXTWIDO",131.12,131.12,131.12,393.36,3,11,20,"D","N","333IXTWIDOM","B_KNAUFAUSF","KNK6",null,null,null,null,null,null,null,null,null,null,null,null,null,null,null,null,null,null,"B",null,null,null,null,null,null,"M",null,null,51]
["333MK6SKG3|IXTWIDO","333MK6SKG3","IXTWIDO",137.97999999999999,137.97999999999999,137.97999999999999,413.93999999999994,3,11,20,"D","N","333IXTWIDOM SKG3","B_KNAUFAUSF","KNK6",null,null,null,null,null,null,null,null,null,null,null,null,null,null,null,null,null,null,"B",null,null,null,null,null,null,"M",null,null,53]
["333MK1SKG3|IXTWIDO","333MK1SKG3","IXTWIDO",144.19,144.19,144.19,432.57,3,11,20,"D","N","333IXTWIDOM SKG3","B_KNAUFAUSF","KNK1",null,null,null,null,null,null,null,null,null,null,null,null,null,null,null,null,null,null,"B",null,null,null,null,null,null,"M",null,null,54]
["333MK2SKG3|IXTWIDO","333MK2SKG3","IXTWIDO",144.19,144.19,144.19,432.57,3,11,20,"D","N","333IXTWIDOM SKG3","B_KNAUFAUSF","KNK2",null,null,null,null,null,null,null,null,null,null,null,null,null,null,null,null,null,null,"B",null,null,null,null,null,null,"M",null,null,55]
["333MK3SKG3|IXTWIDO","333MK3SKG3","IXTWIDO",144.19,144.19,144.19,432.57,3,11,20,"D","N","333IXTWIDOM SKG3","B_KNAUFAUSF","KNK3",null,null,null,null,null,null,null,null,null,null,null,null,null,null,null,null,null,null,"B",null,null,null,null,null,null,"M",null,null,56]
["333MK4SKG3|IXTWIDO","333MK4SKG3","IXTWIDO",144.19,144.19,144.19,432.57,3,11,0,"D","N","333IXTWIDOM SKG3","B_KNAUFAUSF","KNK4",null,null,null,null,null,null,null,null,null,null,null,null,null,null,null,null,null,null,"B",null,null,null,null,null,null,"M",null,null,57]
[{"$f":"CONCATENATE(B451,\"|\",C451)","v":"333MK7|IXTWIDO"},"333MK7","IXTWIDO",167.43,167.43,167.43,502.29,31,10,0,"D","N","333IXTWIDOM K7 SKG3",null,null,"","","","","","","","","","","","","","","","","","","B",null,null,null,null,null,null,"M",null,null,58]
["333KL|IXTWIDO","333KL","IXTWIDO",102.94,102.94,102.94,308.82,5,1,0,"D","N","333IXTWIDOKL",null,null,"","","","","","","","","","","","","","","","","","","B",null,null,null,null,null,null,"M",null,null,62]
["333KLK6|IXTWIDO","333KLK6","IXTWIDO",102.94,102.94,102.94,308.82,5,1,0,"D","N","333IXTWIDOKL","B_KNAUFAUSF","KNK6","","","","","","","","","","","","","","","","","","","B",null,null,null,null,null,null,"M",null,null,63]
["333KLT|IXTWIDO","333KLT","IXTWIDO",110.4,110.4,110.4,331.20000000000005,5,1,0,"D","N","333IXTWIDOKL","B_FUNKTIONEN","FUT","","","","","","","","","","","","","","","","","","","B",null,null,null,null,null,null,"M",null,null,65]
["333RI-10|IXTWIDO","333RI-10","IXTWIDO",121.2,121.2,121.2,363.6,1,11,0,"D","N","333IXTWIDO","B_MITNEHMERAUSF","MIRI10",null,null,null,null,null,null,null,null,null,null,null,null,null,null,null,null,null,null,"B",null,null,null,null,null,null,"M",null,null,65.5]
["333RI-14|IXTWIDO","333RI-14","IXTWIDO",121.2,121.2,121.2,363.6,1,11,0,"D","N","333IXTWIDO","B_MITNEHMERAUSF","MIRI14",null,null,null,null,null,null,null,null,null,null,null,null,null,null,null,null,null,null,"B",null,null,null,null,null,null,"M",null,null,65.599999999999994]
["472|IXTWIDO","472","IXTWIDO",112.75,112.75,112.75,338.25,1,1,0,"D","N","2222IXTWIDO",null,null,null,null,null,null,"","","","","","","","","","","","","","","B",null,null,null,null,null,null,"M",null,null,66]
["472H|IXTWIDO","472H","IXTWIDO",101.48,101.48,101.48,304.44,4,4,8,"H","N","2222IXTWIDOH",null,null,null,null,null,null,"","","","","","","","","","","","","","","B",null,null,null,null,null,null,"M",null,null,67]
["472K6|IXTWIDO","472K6","IXTWIDO",129.66,129.66,129.66,388.98,1,1,0,"D","N","2222IXTWIDO","B_KNAUFAUSF","KNK6",null,null,null,null,"","","","","","","","","","","","","","","B",null,null,null,null,null,null,"M",null,null,68]
["555P|IXTWIDO","555P","IXTWIDO",112.75,112.75,112.75,338.25,0,12,0,"H","N","555IXTWIDO","B_AUSFUEHRUNG_ROHR_PLATTE","RPP",null,null,null,null,null,null,null,null,null,null,null,null,null,null,null,null,null,null,"B","x",62.2,null,null,null,null,"M",null,null,69]
["555PSKG2|IXTWIDO","555PSKG2","IXTWIDO",119.61,119.61,119.61,338.25,0,12,0,"H","N","555IXTWIDO SKG2","B_AUSFUEHRUNG_ROHR_PLATTE","RPP",null,null,null,null,null,null,null,null,null,null,null,null,null,null,null,null,null,null,"B","x",62.2,null,null,null,null,"M",null,null,69.099999999999994]
["325L|IXTWIDO","325L","IXTWIDO",88.24,88.24,88.24,{"$f":"D462+E462+F462","v":264.71999999999997},0,12,0,"H","N","325IXTWIDO","B_AUSFUEHRUNG_325","LIPS",null,null,null,null,null,null,null,null,null,null,null,null,null,null,null,null,null,null,"B",null,null,null,null,null,null,"M",null,null,71]
["325L/1754DR1|IXTWIDO","325L/1754DR1","IXTWIDO",280.44,280.44,280.44,841.31999999999994,0,12,0,"H","N","325IXTWIDO","B_AUSFUEHRUNG_325","LIPS",null,null,null,null,null,null,null,null,null,null,null,null,null,null,null,null,null,null,"B",null,null,null,null,null,null,"M",null,null,72]
["325L/1754DR2|IXTWIDO","325L/1754DR2","IXTWIDO",280.44,280.44,280.44,841.31999999999994,0,12,0,"H","N","325IXTWIDO","B_AUSFUEHRUNG_325","LIPS",null,null,null,null,null,null,null,null,null,null,null,null,null,null,null,null,null,null,"B",null,null,null,null,null,null,"M",null,null,73]
["325/464|IXTWIDO","325/464","IXTWIDO",0,0,0,0,0,0,0,"H","N","325IXTWIDO3464",null,null,null,null,null,null,null,null,null,null,null,null,null,null,null,null,null,null,null,null,"B",null,null,null,null,null,null,"M",null,null,74]
["777G3|IXTWIDO","777G3","IXTWIDO",131.13999999999999,131.13999999999999,131.13999999999999,393.41999999999996,0,0,21,"H","N","777IXTWIDOG3",null,null,null,null,null,null,null,null,null,null,null,null,null,null,null,null,null,null,null,null,"B","x",1,null,null,null,null,"M",null,null,75]
["777G3-HB60|IXTWIDO","777G3-HB60","IXTWIDO",143,143,143,429,0,0,21,"H","N","777IXTWIDOG3","B_BUEGELLAENGE","BU60",null,null,null,null,null,null,null,null,null,null,null,null,null,null,null,null,null,null,"B","x",1,null,null,null,null,"M",null,null,76]
["777G3-HB120|IXTWIDO","777G3-HB120","IXTWIDO",145.72,145.72,145.72,437.15999999999997,0,0,21,"H","N","777IXTWIDOG3","B_BUEGELLAENGE","BU120",null,null,null,null,null,null,null,null,null,null,null,null,null,null,null,null,null,null,"B","x",1,null,null,null,null,"M",null,null,77]
["382LI|IXTWIDO","382LI","IXTWIDO",88.24,88.24,88.24,264.71999999999997,0,12,4,"H","N","382IXTWIDO","B_TEILENR_HEBEL_10_8_BAU","200013F013","B_AUSFUEHRUNG_LI_RE","AGLI",null,null,null,null,null,null,null,null,null,null,null,null,null,null,null,null,"B","x",55.4,null,null,null,null,"M",null,null,78]
["382RE|IXTWIDO","382RE","IXTWIDO",88.24,88.24,88.24,264.71999999999997,0,12,4,"H","N","382IXTWIDO","B_TEILENR_HEBEL_10_8_BAU","200013F013","B_AUSFUEHRUNG_LI_RE","AGRE",null,null,null,null,null,null,null,null,null,null,null,null,null,null,null,null,"B","x",55.4,null,null,null,null,"M",null,null,79]
["393|IXTWIDO","393","IXTWIDO",112.75,112.75,112.75,338.25,0,4,5,"H","N","393IXTWIDO",null,null,null,null,null,null,null,null,null,null,null,null,null,null,null,null,null,null,null,null,"B","x",110.6,null,null,null,null,"M",null,null,80]
["3020/473|IXTWIDO","3020/473","IXTWIDO",129,129,129,387,0,0,0,"H","N","3020/473IXTWIDO","B_RUNDMUTTER_3020","217060","B_TNR_FUEHRUNGSDUEBEL_BAUZYL","217128F","B_TNR_SCHLIESSBLECH_BAUZYL","222750 002","B_TNR_WERKZEUG_BAUZYLINDER","204271 002",null,null,null,null,null,null,null,null,null,null,null,null,"B",null,null,null,null,null,null,"M",null,null,84]
["3020/473 ESP|IXTWIDO","3020/473 ESP","IXTWIDO",129,129,129,387,0,0,0,"H","N","3020/473IXTWIDO","B_RUNDMUTTER_3020","217060","B_TNR_DREHSTANGE_BAUZYL","205185 001","B_TNR_ANSCHLAGSTIFT_BAUZYL","207257F002","B_TNR_SCHLIESSHAKEN_BAUZYL","204476F002","B_TNR_SCHLIESSHAKEN_2_BAUZYL","204478F002","B_TNR_SCHLAUFEN_UNTERTEIL","218420F002","B_TNR_SCHLAUFEN_OBERTEIL","218418F002","B_TNR_SCHLIESSBLECH_BAUZYL","222750 002","B_TNR_FUEHRUNGSDUEBEL_BAUZYL","217128F","B_TNR_BUCHSE_DREHSTANGE","218422F036","B",null,null,null,null,null,null,"M",null,null,85]
["3020/4015|IXTWIDO","3020/4015","IXTWIDO",129,129,129,387,0,0,0,"H","N","3020/4015IXTWIDO","B_RUNDMUTTER_3020","217060","B_TNR_FUEHRUNGSDUEBEL_BAUZYL","217128F","B_TNR_SCHLIESSBLECH_BAUZYL","222750 002","B_TNR_WERKZEUG_BAUZYLINDER","204271 002",null,null,null,null,null,null,null,null,null,null,null,null,"B",null,null,null,null,null,null,"M",null,null,86]
["3020/4015 ESP|IXTWIDO","3020/4015 ESP","IXTWIDO",129,129,129,387,0,0,0,"H","N","3020/4015IXTWIDO","B_RUNDMUTTER_3020","217060","B_TNR_DREHSTANGE_BAUZYL","205185 001","B_TNR_ANSCHLAGSTIFT_BAUZYL","207257F002","B_TNR_SCHLIESSHAKEN_BAUZYL","204476F002","B_TNR_SCHLIESSHAKEN_2_BAUZYL","204478F002","B_TNR_SCHLAUFEN_UNTERTEIL","218420F002","B_TNR_SCHLAUFEN_OBERTEIL","218418F002","B_TNR_SCHLIESSBLECH_BAUZYL","222750 002","B_TNR_FUEHRUNGSDUEBEL_BAUZYL","217128F","B_TNR_BUCHSE_DREHSTANGE","218422F036","B",null,null,null,null,null,null,"M",null,null,87]
["|IXTWIDO",null,"IXTWIDO",0,0,0,0,0,0,0,"H","N",235271,null,null,null,null,null,null,null,null,null,null,null,null,null,null,null,null,null,null,null,null,"B",null,null,null,null,null,null,"M"]
["333|IXTWINSTAR","333","IXTWINSTAR",150.52000000000001,150.52000000000001,150.52000000000001,451.56000000000006,1,11,20,"D","N","333IXSTAR",null,null,null,null,null,null,null,null,null,null,null,null,null,null,null,null,null,null,null,null,"B","x",1,null,null,null,null,"M",null,null,1]
["333SKG2|IXTWINSTAR","333SKG2","IXTWINSTAR",157.38,157.38,157.38,472.14,33,11,20,"D","N","333IXSTAR SKG2",null,null,null,null,null,null,null,null,null,null,null,null,null,null,null,null,null,null,null,null,"B",null,null,null,null,null,null,"M",null,null,2]
["333H|IXTWINSTAR","333H","IXTWINSTAR",135.47999999999999,135.47999999999999,135.47999999999999,406.43999999999994,4,12,8,"H","N","333IXSTARH",null,null,null,null,null,null,null,null,null,null,null,null,null,null,null,null,null,null,null,null,"B","x",70,null,null,null,null,"M",null,null,2.1]
["333HSKG2|IXTWINSTAR","333HSKG2","IXTWINSTAR",142.34,142.34,142.34,427.02,35,12,8,"H","N","333IXSTARH SKG2",null,null,null,null,null,null,null,null,null,null,null,null,null,null,null,null,null,null,null,null,"B",null,null,null,null,null,null,"M",null,null,2.2000000000000002]
["333K6|IXTWINSTAR","333K6","IXTWINSTAR",158.07,158.07,158.07,474.21,1,11,20,"D","N","333IXSTAR","B_KNAUFAUSF","KNK6",null,null,null,null,null,null,null,null,null,null,null,null,null,null,null,null,null,null,"B",null,null,null,null,null,null,"M",null,null,2.2999999999999998]
["333K6SKG2|IXTWINSTAR","333K6SKG2","IXTWINSTAR",164.93,164.93,164.93,494.79,33,11,20,"D","N","333IXSTAR SKG2","B_KNAUFAUSF","KNK6",null,null,null,null,null,null,null,null,null,null,null,null,null,null,null,null,null,null,"B",null,null,null,null,null,null,"M",null,null,2.4]
["333T|IXTWINSTAR","333T","IXTWINSTAR",157.97999999999999,157.97999999999999,157.97999999999999,473.93999999999994,1,11,3,"D","N","333IXSTAR","B_FUNKTIONEN","FUT",null,null,null,null,null,null,null,null,null,null,null,null,null,null,null,null,null,null,"B",null,null,null,null,null,null,"M",null,null,4]
["333TSKG2|IXTWINSTAR","333TSKG2","IXTWINSTAR",164.84,164.84,164.84,494.52,33,11,3,"D","N","333IXSTAR SKG2","B_FUNKTIONEN","FUT",null,null,null,null,null,null,null,null,null,null,null,null,null,null,null,null,null,null,"B",null,null,null,null,null,null,"M",null,null,5]
["333FRL|IXTWINSTAR","333FRL","IXTWINSTAR",160.71,160.71,160.71,482.13,24,11,0,"D","N","333IXSTAR FRL",null,null,null,null,null,null,null,null,null,null,null,null,null,null,null,null,null,null,null,null,"B","x",102.1,null,null,null,null,"M",null,null,7]
["333FRLSKG2|IXTWINSTAR","333FRLSKG2","IXTWINSTAR",167.57,167.57,167.57,502.71,24,11,0,"D","N","333IXSTAR FRL SKG2",null,null,null,null,null,null,null,null,null,null,null,null,null,null,null,null,null,null,null,null,"B",null,null,null,null,null,null,"M",null,null,8]
["333M|IXTWINSTAR","333M","IXTWINSTAR",181.62,181.62,181.62,544.86,3,11,20,"D","N","333IXSTARM",null,null,null,null,null,null,null,null,null,null,null,null,null,null,null,null,null,null,null,null,"B","x",null,null,null,null,null,"M",null,null,12]
["333MSKG3|IXTWINSTAR","333MSKG3","IXTWINSTAR",189.5,189.5,189.5,568.5,3,11,20,"D","N","333IXSTARMB SKG3",null,null,null,null,null,null,null,null,null,null,null,null,null,null,null,null,null,null,null,null,"B",null,null,null,null,null,null,"M",null,null,14]
["333MT|IXTWINSTAR","333MT","IXTWINSTAR",189.08,189.08,189.08,567.24,3,11,3,"D","N","333IXSTARM","B_FUNKTIONEN","FUT",null,null,null,null,null,null,null,null,null,null,null,null,null,null,null,null,null,null,"B",null,null,null,null,null,null,"M",null,null,15]
["333MTSKG3|IXTWINSTAR","333MTSKG3","IXTWINSTAR",195.94,195.94,195.94,587.81999999999994,3,11,3,"D","N","333IXSTARMB SKG3","B_FUNKTIONEN","FUT",null,null,null,null,null,null,null,null,null,null,null,null,null,null,null,null,null,null,"B",null,null,null,null,null,null,"M",null,null,15.1]
["333HFRL|IXTWINSTAR","333HFRL","IXTWINSTAR",145.66999999999999,145.66999999999999,145.66999999999999,437.01,25,12,8,"H","N","333IXSTARH FRL",null,null,null,null,null,null,null,null,null,null,null,null,null,null,null,null,null,null,null,null,"B","x",70,null,null,null,null,"M",null,null,24]
["333HFRLSKG2|IXTWINSTAR","333HFRLSKG2","IXTWINSTAR",152.53,152.53,152.53,457.59000000000003,25,12,8,"H","N","333IXSTARH FRL SKG2",null,null,null,null,null,null,null,null,null,null,null,null,null,null,null,null,null,null,null,null,"B","x",70,null,null,null,null,"M",null,null,25]
["333MH|IXTWINSTAR","333MH","IXTWINSTAR",163.44999999999999,163.44999999999999,163.44999999999999,490.34999999999997,17,12,0,"H","N","333IXSTARHM",null,null,null,null,null,null,null,null,null,null,null,null,null,null,null,null,null,null,null,null,"B","x",null,null,null,null,null,"M",null,null,27]
["333MHSKG3|IXTWINSTAR","333MHSKG3","IXTWINSTAR",170.31,170.31,170.31,510.93,17,12,8,"H","N","333IXSTARHMB SKG3",null,null,null,null,null,null,null,null,null,null,null,null,null,null,null,null,null,null,null,null,"B",null,null,null,null,null,null,"M",null,null,29]
["333K1|IXTWINSTAR","333K1","IXTWINSTAR",164.28,164.28,164.28,492.84000000000003,1,11,20,"D","N","333IXSTAR","B_KNAUFAUSF","KNK1",null,null,null,null,null,null,null,null,null,null,null,null,null,null,null,null,null,null,"B",null,null,null,null,null,null,"M",null,null,36]
["333K1SKG2|IXTWINSTAR","333K1SKG2","IXTWINSTAR",171.14,171.14,171.14,513.41999999999996,33,11,20,"D","N","333IXSTAR SKG2","B_KNAUFAUSF","KNK1",null,null,null,null,null,null,null,null,null,null,null,null,null,null,null,null,null,null,"B",null,null,null,null,null,null,"M",null,null,37]
["333K2|IXTWINSTAR","333K2","IXTWINSTAR",164.28,164.28,164.28,492.84000000000003,1,11,20,"D","N","333IXSTAR","B_KNAUFAUSF","KNK2",null,null,null,null,null,null,null,null,null,null,null,null,null,null,null,null,null,null,"B",null,null,null,null,null,null,"M",null,null,39]
["333K2SKG2|IXTWINSTAR","333K2SKG2","IXTWINSTAR",171.14,171.14,171.14,513.41999999999996,33,11,20,"D","N","333IXSTAR SKG2","B_KNAUFAUSF","KNK2",null,null,null,null,null,null,null,null,null,null,null,null,null,null,null,null,null,null,"B",null,null,null,null,null,null,"M",null,null,40]
["333K3|IXTWINSTAR","333K3","IXTWINSTAR",164.28,164.28,164.28,492.84000000000003,1,11,20,"D","N","333IXSTAR","B_KNAUFAUSF","KNK3",null,null,null,null,null,null,null,null,null,null,null,null,null,null,null,null,null,null,"B",null,null,null,null,null,null,"M",null,null,42]
["333K3SKG2|IXTWINSTAR","333K3SKG2","IXTWINSTAR",171.14,171.14,171.14,513.41999999999996,33,11,20,"D","N","333IXSTAR SKG2","B_KNAUFAUSF","KNK3",null,null,null,null,null,null,null,null,null,null,null,null,null,null,null,null,null,null,"B",null,null,null,null,null,null,"M",null,null,43]
["333K4|IXTWINSTAR","333K4","IXTWINSTAR",164.28,164.28,164.28,492.84000000000003,1,11,0,"D","N","333IXSTAR","B_KNAUFAUSF","KNK4",null,null,null,null,null,null,null,null,null,null,null,null,null,null,null,null,null,null,"B",null,null,null,null,null,null,"M",null,null,45]
["333K4SKG2|IXTWINSTAR","333K4SKG2","IXTWINSTAR",171.14,171.14,171.14,513.41999999999996,33,11,0,"D","N","333IXSTAR SKG2","B_KNAUFAUSF","KNK4",null,null,null,null,null,null,null,null,null,null,null,null,null,null,null,null,null,null,"B",null,null,null,null,null,null,"M",null,null,46]
["333K7|IXTWINSTAR","333K7","IXTWINSTAR",194.38,194.38,194.38,583.14,30,10,0,"D","N","333IXSTAR K7 SKG2",null,null,"","","","","","","","","","","","","","","","","","","B",null,null,null,null,null,null,"M",null,null,48]
["333K7SKG2|IXTWINSTAR","333K7SKG2","IXTWINSTAR",201.24,201.24,201.24,603.72,30,10,0,"D","N","333IXSTAR K7 SKG2",null,null,"","","","","","","","","","","","","","","","","","","B",null,null,null,null,null,null,"M",null,null,49]
["333K6KRU|IXTWINSTAR","333K6KRU","IXTWINSTAR",181.29,181.29,181.29,543.87,1,11,20,"D","N","333IXSTAR KRU","B_KNAUFAUSF","KNK6",null,null,null,null,null,null,null,null,null,null,null,null,null,null,null,null,null,null,"B",null,null,null,null,null,null,"M",null,null,50]
["333MK6|IXTWINSTAR","333MK6","IXTWINSTAR",190.68,190.68,190.68,572.04,3,11,20,"D","N","333IXSTARM","B_KNAUFAUSF","KNK6",null,null,null,null,null,null,null,null,null,null,null,null,null,null,null,null,null,null,"B",null,null,null,null,null,null,"M",null,null,51]
["333MK6SKG3|IXTWINSTAR","333MK6SKG3","IXTWINSTAR",197.54,197.54,197.54,592.62,3,11,20,"D","N","333IXSTARMB SKG3","B_KNAUFAUSF","KNK6",null,null,null,null,null,null,null,null,null,null,null,null,null,null,null,null,null,null,"B",null,null,null,null,null,null,"M",null,null,53]
["333MK1SKG3|IXTWINSTAR","333MK1SKG3","IXTWINSTAR",203.75,203.75,203.75,611.25,3,11,20,"D","N","333IXSTARMB SKG3","B_KNAUFAUSF","KNK1",null,null,null,null,null,null,null,null,null,null,null,null,null,null,null,null,null,null,"B",null,null,null,null,null,null,"M",null,null,54]
["333MK2SKG3|IXTWINSTAR","333MK2SKG3","IXTWINSTAR",203.75,203.75,203.75,611.25,3,11,20,"D","N","333IXSTARMB SKG3","B_KNAUFAUSF","KNK2",null,null,null,null,null,null,null,null,null,null,null,null,null,null,null,null,null,null,"B",null,null,null,null,null,null,"M",null,null,55]
["333MK3SKG3|IXTWINSTAR","333MK3SKG3","IXTWINSTAR",203.75,203.75,203.75,611.25,3,11,20,"D","N","333IXSTARMB SKG3","B_KNAUFAUSF","KNK3",null,null,null,null,null,null,null,null,null,null,null,null,null,null,null,null,null,null,"B",null,null,null,null,null,null,"M",null,null,56]
["333MK4SKG3|IXTWINSTAR","333MK4SKG3","IXTWINSTAR",203.75,203.75,203.75,611.25,3,11,0,"D","N","333IXSTARMB SKG3","B_KNAUFAUSF","KNK4",null,null,null,null,null,null,null,null,null,null,null,null,null,null,null,null,null,null,"B",null,null,null,null,null,null,"M",null,null,57]
["333MK7|IXTWINSTAR","333MK7","IXTWINSTAR",226.99,226.99,226.99,680.97,31,10,0,"D","N","333IXSTARMB K7 SKG3",null,null,"","","","","","","","","","","","","","","","","","","B",null,null,null,null,null,null,"M",null,null,58]
["333MK7SKG3|IXTWINSTAR","333MK7SKG3","IXTWINSTAR",233.85,233.85,233.85,701.55,31,10,0,"D","N","333IXSTARMB K7 SKG3",null,null,"","","","","","","","","","","","","","","","","","","B",null,null,null,null,null,null,"M",null,null,60]
["333KL|IXTWINSTAR","333KL","IXTWINSTAR",158.07,158.07,158.07,474.21,5,11,0,"D","N","333IXSTARKL",null,null,"","","","","","","","","","","","","","","","","","","B",null,null,null,null,null,null,"M",null,null,62]
[{"$f":"CONCATENATE(B515,\"|\",C515)","v":"333KLK6|IXTWINSTAR"},"333KLK6","IXTWINSTAR",158.07,158.07,158.07,474.21,5,11,0,"D","N","333IXSTARKL","B_KNAUFAUSF","KNK6","","","","","","","","","","","","","","","","","","","B",null,null,null,null,null,null,"M",null,null,63]
["333KLT|IXTWINSTAR","333KLT","IXTWINSTAR",165.53,165.53,165.53,496.59000000000003,5,11,0,"D","N","333IXSTARKL","B_FUNKTIONEN","FUT","","","","","","","","","","","","","","","","","","","B",null,null,null,null,null,null,"M",null,null,65]
["333RI-10|IXTWINSTAR","333RI-10","IXTWINSTAR",173.68,173.68,173.68,521.04,1,11,0,"D","N","333IXSTAR","B_MITNEHMERAUSF","MIRI10",null,null,null,null,null,null,null,null,null,null,null,null,null,null,null,null,null,null,"B",null,null,null,null,null,null,"M",null,null,65.5]
["333RI-14|IXTWINSTAR","333RI-14","IXTWINSTAR",173.68,173.68,173.68,521.04,1,11,0,"D","N","333IXSTAR","B_MITNEHMERAUSF","MIRI14",null,null,null,null,null,null,null,null,null,null,null,null,null,null,null,null,null,null,"B",null,null,null,null,null,null,"M",null,null,65.599999999999994]
["472|IXTWINSTAR","472","IXTWINSTAR",173.1,173.1,173.1,519.29999999999995,26,1,0,"D","N","2222IXSTAR","","","","","","","","","","","","","","","","","","","","","B",null,null,null,null,null,null,"M",null,null,66]
["472H|IXTWINSTAR","472H","IXTWINSTAR",155.77000000000001,155.77000000000001,155.77000000000001,467.31000000000006,27,4,8,"H","N","2222IXSTARH","","","","","","","","","","","","","","","","","","","","","B",null,null,null,null,null,null,"M",null,null,67]
["472K6|IXTWINSTAR","472K6","IXTWINSTAR",181.74,181.74,181.74,545.22,26,1,0,"D","N","2222IXSTAR","B_KNAUFAUSF","KNK6","","","","","","","","","","","","","","","","","","","B",null,null,null,null,null,null,"M",null,null,68]
["555P|IXTWINSTAR","555P","IXTWINSTAR",158.07,158.07,158.07,474.21,0,4,0,"H","N","555IXSTAR","B_AUSFUEHRUNG_ROHR_PLATTE","RPP",null,null,null,null,null,null,null,null,null,null,null,null,null,null,null,null,null,null,"B","x",62.2,null,null,null,null,"M",null,null,69]
["325/464|IXTWINSTAR","325/464","IXTWINSTAR",0,0,0,0,0,0,0,"H","N","325IXSTAR3464",null,null,null,null,null,null,null,null,null,null,null,null,null,null,null,null,null,null,null,null,"B",null,null,null,null,null,null,"M",null,null,74]
["777G3|IXTWINSTAR","777G3","IXTWINSTAR",178.38,178.38,178.38,535.14,0,0,21,"H","N","777IXSTARG3",null,null,null,null,null,null,null,null,null,null,null,null,null,null,null,null,null,null,null,null,"B","x",1,null,null,null,null,"M",null,null,75]
["777G3-HB60|IXTWINSTAR","777G3-HB60","IXTWINSTAR",190.24,190.24,190.24,570.72,0,0,21,"H","N","777IXSTARG3","B_BUEGELLAENGE","BU60",null,null,null,null,null,null,null,null,null,null,null,null,null,null,null,null,null,null,"B","x",1,null,null,null,null,"M",null,null,76]
["777G3-HB120|IXTWINSTAR","777G3-HB120","IXTWINSTAR",192.96,192.96,192.96,{"$f":"D526+E526+F526","v":578.88},0,0,21,"H","N","777IXSTARG3","B_BUEGELLAENGE","BU120",null,null,null,null,null,null,null,null,null,null,null,null,null,null,null,null,null,null,"B","x",1,null,null,null,null,"M",null,null,77]
["382LI|IXTWINSTAR","382LI","IXTWINSTAR",135.47999999999999,135.47999999999999,135.47999999999999,406.43999999999994,0,4,4,"H","N","382IXSTAR","B_TEILENR_HEBEL_10_8_BAU","200013F013","B_AUSFUEHRUNG_LI_RE","AGLI",null,null,null,null,null,null,null,null,null,null,null,null,null,null,null,null,"B","x",55.4,null,null,null,null,"M",null,null,78]
["382RE|IXTWINSTAR","382RE","IXTWINSTAR",135.47999999999999,135.47999999999999,135.47999999999999,406.43999999999994,0,4,4,"H","N","382IXSTAR","B_TEILENR_HEBEL_10_8_BAU","200013F013","B_AUSFUEHRUNG_LI_RE","AGRE",null,null,null,null,null,null,null,null,null,null,null,null,null,null,null,null,"B","x",55.4,null,null,null,null,"M",null,null,79]
["393|IXTWINSTAR","393","IXTWINSTAR",202.21,202.21,202.21,606.63,0,4,5,"H","N","393IXSTAR",null,null,null,null,null,null,null,null,null,null,null,null,null,null,null,null,null,null,null,null,"B","x",110.6,null,null,null,null,"M",null,null,80]
["3020/473|IXTWINSTAR","3020/473","IXTWINSTAR",143.44999999999999,143.44999999999999,143.44999999999999,430.34999999999997,0,0,0,"H","N","3020/473IXSTAR","B_RUNDMUTTER_3020","217060","B_TNR_FUEHRUNGSDUEBEL_BAUZYL","217128F","B_TNR_SCHLIESSBLECH_BAUZYL","222750 002","B_TNR_WERKZEUG_BAUZYLINDER","204271 002",null,null,null,null,null,null,null,null,null,null,null,null,"B",null,null,null,null,null,null,"M",null,null,84]
["3020/473 ESP|IXTWINSTAR","3020/473 ESP","IXTWINSTAR",143.44999999999999,143.44999999999999,143.44999999999999,430.34999999999997,0,0,0,"H","N","3020/473IXSTAR","B_RUNDMUTTER_3020","217060","B_TNR_DREHSTANGE_BAUZYL","205185 001","B_TNR_ANSCHLAGSTIFT_BAUZYL","207257F002","B_TNR_SCHLIESSHAKEN_BAUZYL","204476F002","B_TNR_SCHLIESSHAKEN_2_BAUZYL","204478F002","B_TNR_SCHLAUFEN_UNTERTEIL","218420F002","B_TNR_SCHLAUFEN_OBERTEIL","218418F002","B_TNR_SCHLIESSBLECH_BAUZYL","222750 002","B_TNR_FUEHRUNGSDUEBEL_BAUZYL","217128F","B_TNR_BUCHSE_DREHSTANGE","218422F036","B",null,null,null,null,null,null,"M",null,null,85]
["3020/4015|IXTWINSTAR","3020/4015","IXTWINSTAR",143.44999999999999,143.44999999999999,143.44999999999999,430.34999999999997,0,0,0,"H","N","3020/4015IXSTAR","B_RUNDMUTTER_3020","217060","B_TNR_FUEHRUNGSDUEBEL_BAUZYL","217128F","B_TNR_SCHLIESSBLECH_BAUZYL","222750 002","B_TNR_WERKZEUG_BAUZYLINDER","204271 002",null,null,null,null,null,null,null,null,null,null,null,null,"B",null,null,null,null,null,null,"M",null,null,86]
["3020/4015 ESP|IXTWINSTAR","3020/4015 ESP","IXTWINSTAR",143.44999999999999,143.44999999999999,143.44999999999999,430.34999999999997,0,0,0,"H","N","3020/4015IXSTAR","B_RUNDMUTTER_3020","217060","B_TNR_DREHSTANGE_BAUZYL","205185 001","B_TNR_ANSCHLAGSTIFT_BAUZYL","207257F002","B_TNR_SCHLIESSHAKEN_BAUZYL","204476F002","B_TNR_SCHLIESSHAKEN_2_BAUZYL","204478F002","B_TNR_SCHLAUFEN_UNTERTEIL","218420F002","B_TNR_SCHLAUFEN_OBERTEIL","218418F002","B_TNR_SCHLIESSBLECH_BAUZYL","222750 002","B_TNR_FUEHRUNGSDUEBEL_BAUZYL","217128F","B_TNR_BUCHSE_DREHSTANGE","218422F036","B",null,null,null,null,null,null,"M",null,null,87]
["|IXTWINSTAR",null,"IXTWINSTAR",0,0,0,0,0,0,0,null,"N",235271,null,null,null,null,null,null,null,null,null,null,null,null,null,null,null,null,null,null,null,null,"B",null,null,null,null,null,null,"M"]
["333|IXTWINSTAR-C","333","IXTWINSTAR-C",1,1,1,3,1,1,2,"D","n","333IXSTARC","B_SCHUTZ","SC","B_FUNKTIONEN","FUT","B_VDS_KLASSE","VDVDS B",null,null,null,null,null,null,null,null,null,null,null,null,null,null,"B","x",1,null,null,null,null,"M",null,null,1]
["333H|IXTWINSTAR-C","333H","IXTWINSTAR-C",1,1,1,3,4,4,8,"H","n","333IXSTARCH",null,null,null,null,null,null,null,null,null,null,null,null,null,null,null,null,null,null,null,null,"B","x",70,null,null,null,null,"M",null,null,2.1]
["333K6|IXTWINSTAR-C","333K6","IXTWINSTAR-C",1,1,1,3,1,1,3,"D","n","333IXSTARC","B_KNAUFAUSF","KNK6","B_SCHUTZ","SC","B_FUNKTIONEN","FUT","B_VDS_KLASSE","VDVDS B",null,null,null,null,null,null,null,null,null,null,null,null,"B","x",null,null,null,null,null,"M",null,null,2.2999999999999998]
["333T|IXTWINSTAR-C","333T","IXTWINSTAR-C",1,1,1,3,1,1,13,"D","n","333IXSTARC","B_FUNKTIONEN","FUT","B_SCHUTZ","SC","B_VDS_KLASSE","VDVDS B",null,null,null,null,null,null,null,null,null,null,null,null,null,null,"B","x",null,null,null,null,null,"M",null,null,4]
["333FRL|IXTWINSTAR-C","333FRL","IXTWINSTAR-C",1,1,1,3,1,1,0,"D","n","333IXSTARC FRL",null,null,null,null,null,null,null,null,null,null,null,null,null,null,null,null,null,null,null,null,"B","x",102.1,null,null,null,null,"M",null,null,7]
["333M|IXTWINSTAR-C","333M","IXTWINSTAR-C",1,1,1,3,3,1,1,"D","n","333IXSTARCM","B_SCHUTZ","SC","B_FUNKTIONEN","FUT","B_VDS_KLASSE","VDVDS B",null,null,null,null,null,null,null,null,null,null,null,null,null,null,"B","x",null,null,null,null,null,"M",null,null,12]
["333HFRL|IXTWINSTAR-C","333HFRL","IXTWINSTAR-C",1,1,1,3,4,1,0,"D","n","333IXSTARCH FRL",null,null,null,null,null,null,null,null,null,null,null,null,null,null,null,null,null,null,null,null,"B","x",102.1,null,null,null,null,"M",null,null,24]
["333MH|IXTWINSTAR-C","333MH","IXTWINSTAR-C",1,1,1,3,17,4,0,"H","n","333IXSTARCHM",null,null,null,null,null,null,null,null,null,null,null,null,null,null,null,null,null,null,null,null,"B","x",null,null,null,null,null,"M",null,null,27]
["333K2|IXTWINSTAR-C","333K2","IXTWINSTAR-C",1,1,1,3,1,1,3,"D","n","333IXSTARC","B_KNAUFAUSF","KNK2","B_SCHUTZ","SC","B_FUNKTIONEN","FUT","B_VDS_KLASSE","VDVDS B",null,null,null,null,null,null,null,null,null,null,null,null,"B","x",null,null,null,null,null,"M",null,null,39]
["333MK6|IXTWINSTAR-C","333MK6","IXTWINSTAR-C",1,1,1,3,3,1,3,"D","n","333IXSTARCM","B_KNAUFAUSF","KNK6","B_SCHUTZ","SC","B_FUNKTIONEN","FUT","B_VDS_KLASSE","VDVDS B",null,null,null,null,null,null,null,null,null,null,null,null,"B","x",null,null,null,null,null,"M",null,null,51]
["333KL|IXTWINSTAR-C","333KL","IXTWINSTAR-C",1,1,1,3,5,1,2,"D","n","333IXSTARCKL","","",null,null,null,null,null,null,null,null,null,null,null,null,null,null,null,null,null,null,"B","x",null,null,null,null,null,"M",null,null,62]
["333KLT|IXTWINSTAR-C","333KLT","IXTWINSTAR-C",1,1,1,3,5,1,1,"D","n","333IXSTARCKL","B_FUNKTIONEN","FUT",null,null,null,null,null,null,null,null,null,null,null,null,null,null,null,null,null,null,"B","x",null,null,null,null,"D","M",null,null,65]
["333RI-10|IXTWINSTAR-C","333RI-10","IXTWINSTAR-C",1,1,1,3,1,1,0,"D","n","333IXSTARC","B_MITNEHMERAUSF","MIRI10","B_SCHUTZ","SC","B_FUNKTIONEN","FUT","B_VDS_KLASSE","VDVDS B",null,null,null,null,null,null,null,null,null,null,null,null,"B","x",null,null,null,null,null,"M",null,null,65.5]
["333RI-14|IXTWINSTAR-C","333RI-14","IXTWINSTAR-C",1,1,1,3,1,1,0,"D","n","333IXSTARC","B_MITNEHMERAUSF","MIRI14","B_SCHUTZ","SC","B_FUNKTIONEN","FUT","B_VDS_KLASSE","VDVDS B",null,null,null,null,null,null,null,null,null,null,null,null,"B","x",null,null,null,null,null,"M",null,null,65.599999999999994]
["555P|IXTWINSTAR-C","555P","IXTWINSTAR-C",1,1,1,3,0,4,0,"H","n","555IXSTARC","B_AUSFUEHRUNG_ROHR_PLATTE","RPP","","","","","","","","","","","","","","","","","","","B","x",null,null,null,null,null,"M",null,null,69]
["325L|IXTWINSTAR-C","325L","IXTWINSTAR-C",1,1,1,3,0,4,0,"H","n","325IXSTARC","B_AUSFUEHRUNG_325","LIPS",null,null,null,null,null,null,null,null,null,null,null,null,null,null,null,null,null,null,"B","x",null,null,null,null,null,"M",null,null,71]
["325/464|IXTWINSTAR-C","325/464","IXTWINSTAR-C",1,1,1,3,0,4,0,"H","n","325IXSTARC","B_AUSFUEHRUNG_325",3464,null,null,null,null,null,null,null,null,null,null,null,null,null,null,null,null,null,null,"B","x",53.1,null,null,null,null,"M",null,null,74]
["777G3|IXTWINSTAR-C","777G3","IXTWINSTAR-C",1,1,1,3,0,0,7,"H","n","777IXSTARCG3","B_SCHUTZ","SC","B_VDS_KLASSE","VDVDS B","","","","","","","","","","","","","","","","","B","x",null,null,null,null,null,"M",null,null,75]
["393|IXTWINSTAR-C","393","IXTWINSTAR-C",1,1,1,3,0,4,5,"H","n","393IXSTARC",null,null,null,null,null,null,null,null,null,null,null,null,null,null,null,null,null,null,null,null,"B","x",110.6,null,null,null,null,"M",null,null,80]
["419 LIPS|IXTWINSTAR-C","419 LIPS","IXTWINSTAR-C",1,1,1,3,0,0,0,null,"N","419IXSTARC LIPS",null,null,null,null,null,null,null,null,null,null,null,null,null,null,null,null,null,null,null,null,"B","x",null,0,null,null,null,"M",null,null,81]
["3020/473|IXTWINSTAR-C","3020/473","IXTWINSTAR-C",1,1,1,3,0,4,0,"H","n","3020/473IXSTARC",null,null,null,null,null,null,null,null,null,null,null,null,null,null,null,null,null,null,null,null,"B","x",null,null,null,null,null,"M",null,null,84]
["3020/4015|IXTWINSTAR-C","3020/4015","IXTWINSTAR-C",1,1,1,3,0,4,32,"H","n","3020/4015IXSTARC","B_RUNDMUTTER_3020","217060","B_TNR_FUEHRUNGSDUEBEL_BAUZYL","217128F","B_TNR_SCHLIESSBLECH_BAUZYL","222750 002","B_TNR_WERKZEUG_BAUZYLINDER","204271 002",null,null,null,null,null,null,null,null,null,null,null,null,"B","x",null,null,null,null,null,"M",null,null,86]
["333SKG2|RS SIGMA","333SKG2","RS SIGMA",52.83,52.83,52.83,158.49,1,11,20,"D","N","333SIG SKG2       ",null,null,null,null,null,null,null,null,null,null,null,null,null,null,null,null,null,null,null,null,"B",null,null,null,null,null,null,"M",null,null,2]
["333HSKG2|RS SIGMA","333HSKG2","RS SIGMA",47.54,47.54,47.54,142.62,4,12,8,"H","N","333SIGH SKG2      ",null,null,null,null,null,null,null,null,null,null,null,null,null,null,null,null,null,null,null,null,"B",null,null,null,null,null,null,"M",null,null,2.2000000000000002]
["333K6SKG2|RS SIGMA","333K6SKG2","RS SIGMA",55.48,55.48,55.48,166.44,1,11,20,"D","N","333SIG SKG2       ","B_KNAUFAUSF","KNK6",null,null,null,null,null,null,null,null,null,null,null,null,null,null,null,null,null,null,"B",null,null,null,null,null,null,"M",null,null,2.4]
["333SKG3|RS SIGMA","333SKG3","RS SIGMA",62.21,62.21,62.21,186.63,1,11,20,"D","N","333SIG SKG3       ",null,null,null,null,null,null,null,null,null,null,null,null,null,null,null,null,null,null,null,null,"B",null,null,null,null,null,null,"M",null,null,3]
["333TSKG2|RS SIGMA","333TSKG2","RS SIGMA",60.29,60.29,60.29,180.87,1,11,3,"D","N","333SIG SKG2","B_FUNKTIONEN","FUT",null,null,null,null,null,null,null,null,null,null,null,null,null,null,null,null,null,null,"B",null,null,null,null,null,null,"M",null,null,5]
["333TSKG3|RS SIGMA","333TSKG3","RS SIGMA",69.67,69.67,69.67,209.01,1,11,3,"D","N","333SIG SKG3","B_FUNKTIONEN","FUT",null,null,null,null,null,null,null,null,null,null,null,null,null,null,null,null,null,null,"B",null,null,null,null,null,null,"M",null,null,6]
["333FRLSKG2|RS SIGMA","333FRLSKG2","RS SIGMA",63.02,63.02,63.02,189.06,1,11,0,"D","N","333SIG FRL SKG2",null,null,null,null,null,null,null,null,null,null,null,null,null,null,null,null,null,null,null,null,"B","x",null,null,null,null,null,"M",null,null,8]
["333FRLSKG3|RS SIGMA","333FRLSKG3","RS SIGMA",72.400000000000006,72.400000000000006,72.400000000000006,217.20000000000002,1,11,0,"D","N","333SIG FRL SKG3",null,null,null,null,null,null,null,null,null,null,null,null,null,null,null,null,null,null,null,null,"B","x",null,null,null,null,null,"M",null,null,9]
["333MSKG2|RS SIGMA","333MSKG2","RS SIGMA",83.1,83.1,83.1,249.29999999999998,3,11,20,"D","N","333SIGM SKG2",null,null,null,null,null,null,null,null,null,null,null,null,null,null,null,null,null,null,null,null,"B",null,null,null,null,null,null,"M",null,null,13]
["333MSKG3|RS SIGMA","333MSKG3","RS SIGMA",92.47,92.47,92.47,277.40999999999997,3,11,20,"D","N","333SIGM SKG3",null,null,null,null,null,null,null,null,null,null,null,null,null,null,null,null,null,null,null,null,"B",null,null,null,null,null,null,"M",null,null,14]
["333MTSKG2|RS SIGMA","333MTSKG2","RS SIGMA",90.56,90.56,90.56,271.68,3,11,3,"D","N","333SIGM SKG2","B_FUNKTIONEN","FUT",null,null,null,null,null,null,null,null,null,null,null,null,null,null,null,null,null,null,"B",null,null,null,null,null,null,"M",null,null,16]
["333MTSKG3|RS SIGMA","333MTSKG3","RS SIGMA",99.93,99.93,99.93,299.79000000000002,3,11,3,"D","N","333SIGM SKG3","B_FUNKTIONEN","FUT",null,null,null,null,null,null,null,null,null,null,null,null,null,null,null,null,null,null,"B",null,null,null,null,null,null,"M",null,null,17]
["333MFRLSKG2|RS SIGMA","333MFRLSKG2","RS SIGMA",93.29,93.29,93.29,279.87,3,11,0,"D","N","333SIGM FRL SKG2",null,null,null,null,null,null,null,null,null,null,null,null,null,null,null,null,null,null,null,null,"B","x",null,null,null,null,null,"M",null,null,19]
["333MFRLSKG3|RS SIGMA","333MFRLSKG3","RS SIGMA",102.66,102.66,102.66,307.98,3,11,0,"D","N","333SIGM FRL SKG3",null,null,null,null,null,null,null,null,null,null,null,null,null,null,null,null,null,null,null,null,"B","x",null,null,null,null,null,"M",null,null,20]
["333HSKG3|RS SIGMA","333HSKG3","RS SIGMA",56.91,56.91,56.91,170.73,4,12,8,"H","N","333SIGH SKG3      ",null,null,null,null,null,null,null,null,null,null,null,null,null,null,null,null,null,null,null,null,"B",null,null,null,null,null,null,"M",null,null,23]
["333HFRLSKG2|RS SIGMA","333HFRLSKG2","RS SIGMA",57.73,57.73,57.73,173.19,4,12,0,"H","N","333SIGH FRL SKG2",null,null,null,null,null,null,null,null,null,null,null,null,null,null,null,null,null,null,null,null,"B","x",null,null,null,null,null,"M",null,null,25]
["333HFRLSKG3|RS SIGMA","333HFRLSKG3","RS SIGMA",67.099999999999994,67.099999999999994,67.099999999999994,201.29999999999998,4,12,0,"H","N","333SIGH FRL SKG3",null,null,null,null,null,null,null,null,null,null,null,null,null,null,null,null,null,null,null,null,"B","x",null,null,null,null,"H","M",null,null,26]
["333MHSKG2|RS SIGMA","333MHSKG2","RS SIGMA",74.760000000000005,74.760000000000005,74.760000000000005,224.28000000000003,17,12,8,"H","N","333SIGHM SKG2",null,null,null,null,null,null,null,null,null,null,null,null,null,null,null,null,null,null,null,null,"B",null,null,null,null,null,null,"M",null,null,28]
["333MHSKG3|RS SIGMA","333MHSKG3","RS SIGMA",84.13,84.13,84.13,252.39,17,12,8,"H","N","333SIGHM SKG3",null,null,null,null,null,null,null,null,null,null,null,null,null,null,null,null,null,null,null,null,"B",null,null,null,null,null,null,"M",null,null,29]
["333MHFRLSKG2|RS SIGMA","333MHFRLSKG2","RS SIGMA",84.95,84.95,84.95,254.85000000000002,17,12,0,"H","N","333SIGHM FRL SKG2",null,null,null,null,null,null,null,null,null,null,null,null,null,null,null,null,null,null,null,null,"B","x",null,null,null,null,null,"M",null,null,31]
["333MHFRLSKG3|RS SIGMA","333MHFRLSKG3","RS SIGMA",94.32,94.32,94.32,282.95999999999998,17,12,0,"H","N","333SIGHM FRL SKG3",null,null,null,null,null,null,null,null,null,null,null,null,null,null,null,null,null,null,null,null,"B","x",null,null,null,null,null,"M",null,null,32]
["333K6SKG3|RS SIGMA","333K6SKG3","RS SIGMA",64.849999999999994,64.849999999999994,64.849999999999994,194.54999999999998,1,11,20,"D","N","333SIG SKG3       ","B_KNAUFAUSF","KNK6",null,null,null,null,null,null,null,null,null,null,null,null,null,null,null,null,null,null,"B",null,null,null,null,null,null,"M",null,null,35]
[{"$f":"CONCATENATE(B579,\"|\",C579)","v":"333K1SKG2|RS SIGMA"},"333K1SKG2","RS SIGMA",61.69,61.69,61.69,185.07,1,11,20,"D","N","333SIG SKG2       ","B_KNAUFAUSF","KNK1",null,null,null,null,null,null,null,null,null,null,null,null,null,null,null,null,null,null,"B",null,null,null,null,null,null,"M",null,null,37]
["333K1SKG3|RS SIGMA","333K1SKG3","RS SIGMA",71.06,71.06,71.06,213.18,1,11,20,"D","N","333SIG SKG3       ","B_KNAUFAUSF","KNK1",null,null,null,null,null,null,null,null,null,null,null,null,null,null,null,null,null,null,"B",null,null,null,null,null,null,"M",null,null,38]
["333K2SKG2|RS SIGMA","333K2SKG2","RS SIGMA",61.69,61.69,61.69,185.07,1,11,20,"D","N","333SIG SKG2       ","B_KNAUFAUSF","KNK2",null,null,null,null,null,null,null,null,null,null,null,null,null,null,null,null,null,null,"B",null,null,null,null,null,null,"M",null,null,40]
["333K2SKG3|RS SIGMA","333K2SKG3","RS SIGMA",71.06,71.06,71.06,213.18,1,11,20,"D","N","333SIG SKG3       ","B_KNAUFAUSF","KNK2",null,null,null,null,null,null,null,null,null,null,null,null,null,null,null,null,null,null,"B",null,null,null,null,null,null,"M",null,null,41]
["333K3SKG2|RS SIGMA","333K3SKG2","RS SIGMA",61.69,61.69,61.69,185.07,1,11,20,"D","N","333SIG SKG2       ","B_KNAUFAUSF","KNK3",null,null,null,null,null,null,null,null,null,null,null,null,null,null,null,null,null,null,"B",null,null,null,null,null,null,"M",null,null,43]
["333K3SKG3|RS SIGMA","333K3SKG3","RS SIGMA",71.06,71.06,71.06,213.18,1,11,20,"D","N","333SIG SKG3       ","B_KNAUFAUSF","KNK3",null,null,null,null,null,null,null,null,null,null,null,null,null,null,null,null,null,null,"B",null,null,null,null,null,null,"M",null,null,44]
["333K4SKG2|RS SIGMA","333K4SKG2","RS SIGMA",61.69,61.69,61.69,185.07,1,11,0,"D","N","333SIG SKG2       ","B_KNAUFAUSF","KNK4",null,null,null,null,null,null,null,null,null,null,null,null,null,null,null,null,null,null,"B",null,null,null,null,null,null,"M",null,null,46]
["333K4SKG3|RS SIGMA","333K4SKG3","RS SIGMA",71.06,71.06,71.06,213.18,1,11,0,"D","N","333SIG SKG3       ","B_KNAUFAUSF","KNK4",null,null,null,null,null,null,null,null,null,null,null,null,null,null,null,null,null,null,"B",null,null,null,null,null,null,"M",null,null,47]
["333K7SKG2|RS SIGMA","333K7SKG2","RS SIGMA",91.79,91.79,91.79,275.37,30,10,0,"D","N","333SIG K7 SKG2",null,null,"","","","","","","","","","","","","","","","","","","B",null,null,null,null,null,null,"M",null,null,49]
["333K6KRU|RS SIGMA","333K6KRU","RS SIGMA",78.7,78.7,78.7,236.10000000000002,1,11,20,"D","N","333SIG KRU","B_KNAUFAUSF","KNK6",null,null,null,null,null,null,null,null,null,null,null,null,null,null,null,null,null,null,"B",null,null,null,null,null,null,"M",null,null,50]
["333MK6SKG2|RS SIGMA","333MK6SKG2","RS SIGMA",87.2,87.2,87.2,261.60000000000002,3,11,20,"D","N","333SIGM SKG2       ","B_KNAUFAUSF","KNK6",null,null,null,null,null,null,null,null,null,null,null,null,null,null,null,null,null,null,"B",null,null,null,null,null,null,"M",null,null,52]
["333MK6SKG3|RS SIGMA","333MK6SKG3","RS SIGMA",96.58,96.58,96.58,{"$f":"D590+E590+F590","v":289.74},3,11,20,"D","N","333SIGM SKG3       ","B_KNAUFAUSF","KNK6",null,null,null,null,null,null,null,null,null,null,null,null,null,null,null,null,null,null,"B",null,null,null,null,null,null,"M",null,null,53]
["333MK7SKG2|RS SIGMA","333MK7SKG2","RS SIGMA",123.51,123.51,123.51,370.53000000000003,31,10,0,"D","N","333SIGM K7 SKG2",null,null,"","","","","","","","","","","","","","","","","","","B",null,null,null,null,null,null,"M",null,null,59]
["333KL|RS SIGMA","333KL","RS SIGMA",55.48,55.48,55.48,166.44,34,11,0,"D","N","333SIGKL",null,null,"","","","","","","","","","","","","","","","","","","B",null,null,null,null,null,null,"M",null,null,62]
["333KLK6|RS SIGMA","333KLK6","RS SIGMA",55.48,55.48,55.48,166.44,34,11,0,"D","N","333SIGKL","B_KNAUFAUSF","KNK6","","","","","","","","","","","","","","","","","","","B",null,null,null,null,null,null,"M",null,null,63]
["333KLT|RS SIGMA","333KLT","RS SIGMA",62.94,62.94,62.94,188.82,34,11,0,"D","N","333SIGKL","B_FUNKTIONEN","FUT","","","","","","","","","","","","","","","","","","","B",null,null,null,null,null,null,"M",null,null,65]
["333RI-10|RS SIGMA","333RI-10","RS SIGMA",75.989999999999995,75.989999999999995,75.989999999999995,227.96999999999997,1,11,0,"D","N","333SIG","B_MITNEHMERAUSF","MIRI10",null,null,null,null,null,null,null,null,null,null,null,null,null,null,null,null,null,null,"B",null,null,null,null,null,null,"M",null,null,65.5]
["333RI-14|RS SIGMA","333RI-14","RS SIGMA",75.989999999999995,75.989999999999995,75.989999999999995,227.96999999999997,1,11,0,"D","N","333SIG","B_MITNEHMERAUSF","MIRI14",null,null,null,null,null,null,null,null,null,null,null,null,null,null,null,null,null,null,"B",null,null,null,null,null,null,"M",null,null,65.599999999999994]
["555PSKG2|RS SIGMA","555PSKG2","RS SIGMA",55.48,55.48,55.48,166.44,0,12,0,"H","N","555SIG SKG2       ",null,null,null,null,null,null,null,null,null,null,null,null,null,null,null,null,null,null,null,null,"B",null,null,null,null,null,null,"M",null,null,70]
["325L|RS SIGMA","325L","RS SIGMA",47.54,47.54,47.54,142.62,0,12,0,"H","N","325SIG","B_AUSFUEHRUNG_325","LIPS",null,null,null,null,null,null,null,null,null,null,null,null,null,null,null,null,null,null,"B",null,null,null,null,null,null,"M",null,null,71]
["325L/1754DR1|RS SIGMA","325L/1754DR1","RS SIGMA",239.74,239.74,239.74,719.22,0,12,0,"H","N","325SIG","B_AUSFUEHRUNG_325","LIPS",null,null,null,null,null,null,null,null,null,null,null,null,null,null,null,null,null,null,"B",null,null,null,null,null,"D","M",null,null,72]
["325L/1754DR2|RS SIGMA","325L/1754DR2","RS SIGMA",239.74,239.74,239.74,719.22,0,12,0,"H","N","325SIG","B_AUSFUEHRUNG_325","LIPS",null,null,null,null,null,null,null,null,null,null,null,null,null,null,null,null,null,null,"B",null,null,null,null,null,"D","M",null,null,73]
["325/464|RS SIGMA","325/464","RS SIGMA",47.54,47.54,47.54,142.62,0,0,0,"H","N","325SIG 3464",null,null,null,null,null,null,null,null,null,null,null,null,null,null,null,null,null,null,null,null,"B",null,null,null,null,null,"D","M",null,null,74]
["777G3|RS SIGMA","777G3","RS SIGMA",90.44,90.44,90.44,271.32,0,0,21,"H","N","777SIGG3",null,null,null,null,null,null,null,null,null,null,null,null,null,null,null,null,null,null,null,null,"B","x",null,null,null,null,null,"M",null,null,75]
["777G3-HB60|RS SIGMA","777G3-HB60","RS SIGMA",102.3,102.3,102.3,306.89999999999998,0,0,21,"H","N","777SIGG3","B_BUEGELLAENGE","BU60",null,null,null,null,null,null,null,null,null,null,null,null,null,null,null,null,null,null,"B","x",null,null,null,null,null,"M",null,null,76]
["777G3-HB120|RS SIGMA","777G3-HB120","RS SIGMA",105.02,105.02,105.02,315.06,0,0,21,"H","N","777SIGG3","B_BUEGELLAENGE","BU120",null,null,null,null,null,null,null,null,null,null,null,null,null,null,null,null,null,null,"B","x",null,null,null,null,null,"M",null,null,77]
["382LI|RS SIGMA","382LI","RS SIGMA",47.54,47.54,47.54,142.62,0,12,4,"H","N","382SIG","B_TEILENR_HEBEL_10_8_BAU","200013F013","B_AUSFUEHRUNG_LI_RE","AGLI",null,null,null,null,null,null,null,null,null,null,null,null,null,null,null,null,"B","x",null,null,null,null,null,"M",null,null,78]
["382RE|RS SIGMA","382RE","RS SIGMA",47.54,47.54,47.54,142.62,0,12,4,"H","N","382SIG","B_TEILENR_HEBEL_10_8_BAU","200013F013","B_AUSFUEHRUNG_LI_RE","AGRE",null,null,null,null,null,null,null,null,null,null,null,null,null,null,null,null,"B","x",null,null,null,null,null,"M",null,null,79]
["393|RS SIGMA","393","RS SIGMA",55.48,55.48,55.48,166.44,0,4,5,"H","N","393RS6",null,null,null,null,null,null,null,null,null,null,null,null,null,null,null,null,null,null,null,null,"B","x",null,null,null,null,null,"M",null,null,80]
["419 LIPS|RS SIGMA","419 LIPS","RS SIGMA",77.17,77.17,77.17,231.51,0,9,0,"H","N","419SIG LIPS",null,null,null,null,null,null,null,null,null,null,null,null,null,null,null,null,null,null,null,null,"B",null,null,null,null,null,null,"M",null,null,81]
["464/325-L|RS SIGMA","464/325-L","RS SIGMA",65.7,65.7,65.7,197.10000000000002,0,9,19,"H","N","3464SIG","B_AUSFUEHRUNG_LI_RE","AGLI",null,null,null,null,null,null,null,null,null,null,null,null,null,null,null,null,null,null,"B","X",null,null,null,null,null,"M",null,null,82]
["464/325-R|RS SIGMA","464/325-R","RS SIGMA",65.7,65.7,65.7,197.10000000000002,0,9,19,"H","N","3464SIG","B_AUSFUEHRUNG_LI_RE","AGRE",null,null,null,null,null,null,null,null,null,null,null,null,null,null,null,null,null,null,"B","x",null,null,null,null,null,"M",null,null,83]
["3020/473|RS SIGMA","3020/473","RS SIGMA",102.17,102.17,102.17,306.51,0,0,0,"H","N","3020/473SIG","B_RUNDMUTTER_3020","217060","B_TNR_FUEHRUNGSDUEBEL_BAUZYL","217128F","B_TNR_SCHLIESSBLECH_BAUZYL","222750 002","B_TNR_WERKZEUG_BAUZYLINDER","204271 002",null,null,null,null,null,null,null,null,null,null,null,null,"B",null,null,null,null,null,null,"M",null,null,84]
["3020/473 ESP|RS SIGMA","3020/473 ESP","RS SIGMA",102.17,102.17,102.17,306.51,0,0,0,"H","N","3020/473SIG","B_RUNDMUTTER_3020","217060","B_TNR_DREHSTANGE_BAUZYL","205185 001","B_TNR_ANSCHLAGSTIFT_BAUZYL","207257F002","B_TNR_SCHLIESSHAKEN_BAUZYL","204476F002","B_TNR_SCHLIESSHAKEN_2_BAUZYL","204478F002","B_TNR_SCHLAUFEN_UNTERTEIL","218420F002","B_TNR_SCHLAUFEN_OBERTEIL","218418F002","B_TNR_SCHLIESSBLECH_BAUZYL","222750 002","B_TNR_FUEHRUNGSDUEBEL_BAUZYL","217128F","B_TNR_BUCHSE_DREHSTANGE","218422F036","B",null,null,null,null,null,null,"M",null,null,85]
["3020/4015|RS SIGMA","3020/4015","RS SIGMA",102.17,102.17,102.17,306.51,0,0,0,"H","N","3020/4015SIG","B_RUNDMUTTER_3020","217060","B_TNR_FUEHRUNGSDUEBEL_BAUZYL","217128F","B_TNR_SCHLIESSBLECH_BAUZYL","222750 002","B_TNR_WERKZEUG_BAUZYLINDER","204271 002",null,null,null,null,null,null,null,null,null,null,null,null,"B",null,null,null,null,null,null,"M",null,null,86]
["3020/4015 ESP|RS SIGMA","3020/4015 ESP","RS SIGMA",102.17,102.17,102.17,306.51,0,0,0,"H","N","3020/4015SIG","B_RUNDMUTTER_3020","217060","B_TNR_DREHSTANGE_BAUZYL","205185 001","B_TNR_ANSCHLAGSTIFT_BAUZYL","207257F002","B_TNR_SCHLIESSHAKEN_BAUZYL","204476F002","B_TNR_SCHLIESSHAKEN_2_BAUZYL","204478F002","B_TNR_SCHLAUFEN_UNTERTEIL","218420F002","B_TNR_SCHLAUFEN_OBERTEIL","218418F002","B_TNR_SCHLIESSBLECH_BAUZYL","222750 002","B_TNR_FUEHRUNGSDUEBEL_BAUZYL","217128F","B_TNR_BUCHSE_DREHSTANGE","218422F036","B",null,null,null,null,null,null,"M",null,null,87]
["|RS SIGMA",null,"RS SIGMA",0,0,0,0,0,0,0,null,"N",235271,null,null,null,null,null,null,null,null,null,null,null,null,null,null,null,null,null,null,null,null,"B",null,null,null,null,null,null,"M"]
["333|RS5","333","RS5",85.16,85.16,85.16,255.48,1,1,20,"D","E","333RS5",null,null,null,null,null,null,null,null,null,null,null,null,null,null,null,null,null,null,null,null,"B","x",1,null,null,null,null,"M",null,null,1]
["333SKG2|RS5","333SKG2","RS5",92.02,92.02,92.02,276.06,1,1,20,"D","E","333RS5 SKG2       ",null,null,null,null,null,null,null,null,null,null,null,null,null,null,null,null,null,null,null,null,"B",null,null,null,null,null,null,"M",null,null,2]
["333H|RS5","333H","RS5",76.650000000000006,76.650000000000006,76.650000000000006,229.95000000000002,4,4,8,"H","E","333RS5H",null,null,null,null,null,null,null,null,null,null,null,null,null,null,null,null,null,null,null,null,"B","x",32.6,null,null,null,null,"M",null,null,2.1]
["333HSKG2|RS5","333HSKG2","RS5",83.51,83.51,83.51,250.53000000000003,4,4,8,"H","E","333RS5H SKG2      ",null,null,null,null,null,null,null,null,null,null,null,null,null,null,null,null,null,null,null,null,"B",null,null,null,null,null,null,"M",null,null,2.2000000000000002]
["333K6|RS5","333K6","RS5",89.39,89.39,89.39,268.17,1,1,20,"D","E","333RS5","B_KNAUFAUSF","KNK6",null,null,null,null,null,null,null,null,null,null,null,null,null,null,null,null,null,null,"B",null,null,null,null,null,null,"M",null,null,2.2999999999999998]
["333K6SKG2|RS5","333K6SKG2","RS5",96.25,96.25,96.25,288.75,1,1,20,"D","E","333RS5 SKG2       ","B_KNAUFAUSF","KNK6",null,null,null,null,null,null,null,null,null,null,null,null,null,null,null,null,null,null,"B",null,null,null,null,null,null,"M",null,null,2.4]
["333T|RS5","333T","RS5",92.62,92.62,92.62,277.86,1,1,3,"D","E","333RS5","B_FUNKTIONEN","FUT",null,null,null,null,null,null,null,null,null,null,null,null,null,null,null,null,null,null,"B",null,null,null,null,null,null,"M",null,null,4]
["333TSKG2|RS5","333TSKG2","RS5",99.48,99.48,99.48,298.44,1,1,3,"D","E","333RS5 SKG2","B_FUNKTIONEN","FUT",null,null,null,null,null,null,null,null,null,null,null,null,null,null,null,null,null,null,"B",null,null,null,null,null,null,"M",null,null,5]
["333FRL|RS5","333FRL","RS5",95.35,95.35,95.35,286.04999999999995,1,1,0,"D","E","333RS5FRL",null,null,null,null,null,null,null,null,null,null,null,null,null,null,null,null,null,null,null,null,"B","x",51.9,null,null,null,null,"M",null,null,7]
["333FRLSKG2|RS5","333FRLSKG2","RS5",102.21,102.21,102.21,306.63,1,1,0,"D","E","333RS5FRL SKG2       ",null,null,null,null,null,null,null,null,null,null,null,null,null,null,null,null,null,null,null,null,"B",null,null,null,null,null,null,"M",null,null,8]
["333M|RS5","333M","RS5",116.27,116.27,116.27,348.81,3,1,20,"D","E","333RS5M",null,null,null,null,null,null,null,null,null,null,null,null,null,null,null,null,null,null,null,null,"B","x",null,null,null,null,null,"M",null,null,12]
["333MSKG2|RS5","333MSKG2","RS5",123.13,123.13,123.13,369.39,3,1,20,"D","E","333RS5M SKG2",null,null,null,null,null,null,null,null,null,null,null,null,null,null,null,null,null,null,null,null,"B",null,null,null,null,null,null,"M",null,null,13]
["333MT|RS5","333MT","RS5",123.73,123.73,123.73,371.19,3,1,3,"D","E","333RS5M","B_FUNKTIONEN","FUT",null,null,null,null,null,null,null,null,null,null,null,null,null,null,null,null,null,null,"B",null,null,null,null,null,null,"M",null,null,15]
["333MFRL|RS5","333MFRL","RS5",126.46,126.46,126.46,379.38,3,1,0,"D","E","333RS5M FRL",null,null,null,null,null,null,null,null,null,null,null,null,null,null,null,null,null,null,null,null,"B","x",null,null,null,null,null,"M",null,null,18]
["333MFRLSKG2|RS5","333MFRLSKG2","RS5",133.32,133.32,133.32,399.96,3,1,0,"D","E","333RS5M FRL SKG2",null,null,null,null,null,null,null,null,null,null,null,null,null,null,null,null,null,null,null,null,"B","x",null,null,null,null,null,"M",null,null,19]
["333HFRL|RS5","333HFRL","RS5",86.84,86.84,86.84,260.52,4,1,0,"H","E","333RS5H FRL",null,null,null,null,null,null,null,null,null,null,null,null,null,null,null,null,null,null,null,null,"B","x",null,null,null,null,null,"M",null,null,24]
["333HFRLSKG2|RS5","333HFRLSKG2","RS5",93.7,93.7,93.7,281.10000000000002,4,1,0,"H","E","333RS5H FRL SKG2",null,null,null,null,null,null,null,null,null,null,null,null,null,null,null,null,null,null,null,null,"B","x",null,null,null,null,null,"M",null,null,25]
["333MH|RS5","333MH","RS5",104.61,104.61,104.61,313.83,17,4,0,"H","E","333RS5HM",null,null,null,null,null,null,null,null,null,null,null,null,null,null,null,null,null,null,null,null,"B","x",null,null,null,null,null,"M",null,null,27]
["333MHSKG2|RS5","333MHSKG2","RS5",111.47,111.47,111.47,334.40999999999997,17,4,8,"H","E","333RS5HM SKG2",null,null,null,null,null,null,null,null,null,null,null,null,null,null,null,null,null,null,null,null,"B",null,null,null,null,null,"D","M",null,null,28]
["333MHFRL|RS5","333MHFRL","RS5",114.8,114.8,114.8,344.4,17,4,8,"H","E","333RS5HM FRL",null,null,null,null,null,null,null,null,null,null,null,null,null,null,null,null,null,null,null,null,"B","x",32.6,null,null,null,null,"M",null,null,30]
["333MHFRLSKG2|RS5","333MHFRLSKG2","RS5",121.66,121.66,121.66,364.98,17,4,0,"H","E","333RS5HM FRL SKG2",null,null,null,null,null,null,null,null,null,null,null,null,null,null,null,null,null,null,null,null,"B","x",null,null,null,null,null,"M",null,null,31]
["333K1|RS5","333K1","RS5",95.6,95.6,95.6,286.79999999999995,1,1,20,"D","E","333RS5","B_KNAUFAUSF","KNK1",null,null,null,null,null,null,null,null,null,null,null,null,null,null,null,null,null,null,"B",null,null,null,null,null,null,"M",null,null,36]
["333K1SKG2|RS5","333K1SKG2","RS5",102.46,102.46,102.46,307.38,1,1,20,"D","E","333RS5 SKG2       ","B_KNAUFAUSF","KNK1",null,null,null,null,null,null,null,null,null,null,null,null,null,null,null,null,null,null,"B",null,null,null,null,null,null,"M",null,null,37]
["333K2|RS5","333K2","RS5",95.6,95.6,95.6,286.79999999999995,1,1,20,"D","E","333RS5","B_KNAUFAUSF","KNK2",null,null,null,null,null,null,null,null,null,null,null,null,null,null,null,null,null,null,"B",null,null,null,null,null,null,"M",null,null,39]
["333K2SKG2|RS5","333K2SKG2","RS5",102.456,102.456,102.456,307.36799999999999,1,1,20,"D","E","333RS5 SKG2       ","B_KNAUFAUSF","KNK2",null,null,null,null,null,null,null,null,null,null,null,null,null,null,null,null,null,null,"B",null,null,null,null,null,null,"M",null,null,40]
["333K3|RS5","333K3","RS5",95.6,95.6,95.6,286.79999999999995,1,1,20,"D","E","333RS5","B_KNAUFAUSF","KNK3",null,null,null,null,null,null,null,null,null,null,null,null,null,null,null,null,null,null,"B",null,null,null,null,null,null,"M",null,null,42]
["333K3SKG2|RS5","333K3SKG2","RS5",102.46,102.46,102.46,307.38,1,1,20,"D","E","333RS5 SKG2       ","B_KNAUFAUSF","KNK3",null,null,null,null,null,null,null,null,null,null,null,null,null,null,null,null,null,null,"B",null,null,null,null,null,null,"M",null,null,43]
[{"$f":"CONCATENATE(B643,\"|\",C643)","v":"333K4|RS5"},"333K4","RS5",95.6,95.6,95.6,286.79999999999995,1,1,0,"D","E","333RS5","B_KNAUFAUSF","KNK4",null,null,null,null,null,null,null,null,null,null,null,null,null,null,null,null,null,null,"B",null,null,null,null,null,null,"M",null,null,45]
["333K4SKG2|RS5","333K4SKG2","RS5",102.46,102.46,102.46,307.38,1,1,0,"D","E","333RS5 SKG2       ","B_KNAUFAUSF","KNK4",null,null,null,null,null,null,null,null,null,null,null,null,null,null,null,null,null,null,"B",null,null,null,null,null,null,"M",null,null,46]
["333MK6|RS5","333MK6","RS5",122.06,122.06,122.06,366.18,3,1,20,"D","E","333RS5M","B_KNAUFAUSF","KNK6",null,null,null,null,null,null,null,null,null,null,null,null,null,null,null,null,null,null,"B",null,null,null,null,null,null,"M",null,null,51]
["333MK6SKG2|RS5","333MK6SKG2","RS5",128.91999999999999,128.91999999999999,128.91999999999999,386.76,3,1,20,"D","E","333RS5M SKG2       ","B_KNAUFAUSF","KNK6",null,null,null,null,null,null,null,null,null,null,null,null,null,null,null,null,null,null,"B",null,null,null,null,null,null,"M",null,null,52]
["333KL|RS5","333KL","RS5",89.39,89.39,89.39,268.17,5,1,18,"D","E","333RS5KL",null,null,null,null,null,null,null,null,null,null,null,null,null,null,null,null,null,null,null,null,"B","x",38.9,null,null,null,null,"M",null,null,62]
["333KLSKG2|RS5","333KLSKG2","RS5",96.25,96.25,96.25,288.75,5,1,18,"D","E","333RS5KLSKG2",null,null,null,null,null,null,null,null,null,null,null,null,null,null,null,null,null,null,null,null,"B",null,null,null,null,null,null,"M",null,null,64]
["555P|RS5","555P","RS5",89.39,89.39,89.39,268.17,0,4,0,"H","E","555RS5","B_AUSFUEHRUNG_ROHR_PLATTE","RPP",null,null,null,null,null,null,null,null,null,null,null,null,null,null,null,null,null,null,"B","x",null,null,null,null,null,"M",null,null,69]
["555PSKG2|RS5","555PSKG2","RS5",96.25,96.25,96.25,288.75,0,4,0,"H","E","555RS5 SKG2       ",null,null,null,null,null,null,null,null,null,null,null,null,null,null,null,null,null,null,null,null,"B",null,null,null,null,null,null,"M",null,null,70]
["325L|RS5","325L","RS5",76.650000000000006,76.650000000000006,76.650000000000006,229.95000000000002,0,1,0,"H","E","235271",null,null,null,null,null,null,null,null,null,null,null,null,null,null,null,null,null,null,null,null,"B",null,null,null,null,null,null,"M",null,null,71]
["325/464|RS5","325/464","RS5",76.650000000000006,76.650000000000006,76.650000000000006,229.95000000000002,0,0,0,"H","E","325RS5 3464",null,null,null,null,null,null,null,null,null,null,null,null,null,null,null,null,null,null,null,null,"B",null,null,null,null,null,null,"M",null,null,74]
["777G3|RS5","777G3","RS5",119.55,119.55,119.55,358.65,0,0,21,"H","E","777RS5G3",null,null,null,null,null,null,null,null,null,null,null,null,null,null,null,null,null,null,null,null,"B","x",null,null,null,null,null,"M",null,null,75]
["777G3-HB60|RS5","777G3-HB60","RS5",131.41,131.41,131.41,{"$f":"D654+E654+F654","v":394.23},0,0,21,"H","E","777RS5G3","B_BUEGELLAENGE","BU60",null,null,null,null,null,null,null,null,null,null,null,null,null,null,null,null,null,null,"B","x",null,null,null,null,null,"M",null,null,76]
["777G3-HB120|RS5","777G3-HB120","RS5",134.13,134.13,134.13,402.39,0,0,21,"H","E","777RS5G3","B_BUEGELLAENGE","BU120",null,null,null,null,null,null,null,null,null,null,null,null,null,null,null,null,null,null,"B","x",null,null,null,null,null,"M",null,null,77]
["393|RS5","393","RS5",97.9,97.9,97.9,293.70000000000005,0,4,5,"H","E","393RS6",null,null,null,null,null,null,null,null,null,null,null,null,null,null,null,null,null,null,null,null,"B","x",null,null,null,null,null,"M",null,null,80]
["419 LIPS|RS5","419 LIPS","RS5",102.2,102.2,102.2,306.60000000000002,0,9,0,null,"E","419RS5LIPS",null,null,null,null,null,null,null,null,null,null,null,null,null,null,null,null,null,null,null,null,"B",null,null,null,null,null,null,"M",null,null,81]
["464/325-L|RS5","464/325-L","RS5",116.87,116.87,116.87,350.61,0,4,19,"H","E","3464RS5","B_AUSFUEHRUNG_LI_RE","AGLI",null,null,null,null,null,null,null,null,null,null,null,null,null,null,null,null,null,null,"B","X",null,null,null,null,null,"M",null,null,82]
["464/325-R|RS5","464/325-R","RS5",116.87,116.87,116.87,350.61,0,4,19,"H","E","3464RS5","B_AUSFUEHRUNG_LI_RE","AGRE",null,null,null,null,null,null,null,null,null,null,null,null,null,null,null,null,null,null,"B","x",null,null,null,null,null,"M",null,null,83]
["|RS5",null,"RS5",0,0,0,0,0,0,0,null,"E",235271,null,null,null,null,null,null,null,null,null,null,null,null,null,null,null,null,null,null,null,null,"B",null,null,null,null,null,"H","M"]
["333|RS8","333","RS8",93.93,93.93,93.93,281.79000000000002,1,1,20,"D","E","333RS8","","","","","","","","","","","","","","","","","","","","","B","x",null,null,null,null,null,"M",null,null,1]
["333SKG2|RS8","333SKG2","RS8",100.79,100.79,100.79,302.37,1,1,20,"D","E","333RS8 SKG2       ",null,null,null,null,null,null,null,null,null,null,null,null,null,null,null,null,null,null,null,null,"B",null,null,null,null,null,null,"M",null,null,2]
["333H|RS8","333H","RS8",84.52,84.52,84.52,253.56,4,4,8,"H","E","333RS8H","","","","","","","","","","","","","","","","","","","","","B","x",null,null,null,null,null,"M",null,null,2.1]
["333HSKG2|RS8","333HSKG2","RS8",91.38,91.38,91.38,274.14,4,4,8,"H","E","333RS8H SKG2      ",null,null,null,null,null,null,null,null,null,null,null,null,null,null,null,null,null,null,null,null,"B",null,null,null,null,null,null,"M",null,null,2.2000000000000002]
["333K6|RS8","333K6","RS8",98.62,98.62,98.62,295.86,1,1,20,"D","E","333RS8","B_KNAUFAUSF","KNK6","","","","","","","","","","","","","","","","","","","B",null,null,null,null,null,null,"M",null,null,2.2999999999999998]
["333K6SKG2|RS8","333K6SKG2","RS8",105.48,105.48,105.48,316.44,1,1,20,"D","E","333RS8 SKG2       ","B_KNAUFAUSF","KNK6",null,null,null,null,null,null,null,null,null,null,null,null,null,null,null,null,null,null,"B",null,null,null,null,null,null,"M",null,null,2.4]
["333T|RS8","333T","RS8",101.39,101.39,101.39,304.17,1,1,3,"D","E","333RS8","B_FUNKTIONEN","FUT","","","","","","","","","","","","","","","","","","","B",null,null,null,null,null,null,"M",null,null,4]
["333TSKG2|RS8","333TSKG2","RS8",108.25,108.25,108.25,324.75,1,1,3,"D","E","333RS8 SKG2","B_FUNKTIONEN","FUT",null,null,null,null,null,null,null,null,null,null,null,null,null,null,null,null,null,null,"B",null,null,null,null,null,null,"M",null,null,5]
["333FRL|RS8","333FRL","RS8",104.12,104.12,104.12,312.36,1,1,0,"D","E","333RS8FRL","","","","","","","","","","","","","","","","","","","","","B","x",null,null,null,null,null,"M",null,null,7]
["333FRLSKG2|RS8","333FRLSKG2","RS8",110.98,110.98,110.98,332.94,1,1,0,"D","E","333RS8FRL SKG2",null,null,null,null,null,null,null,null,null,null,null,null,null,null,null,null,null,null,null,null,"B",null,null,null,null,null,null,"M",null,null,8]
["333M|RS8","333M","RS8",124.44,124.44,124.44,373.32,3,1,20,"D","E","333RS8M ","","","","","","","","","","","","","","","","","","","","","B","x",null,null,null,null,null,"M",null,null,12]
["333MSKG3|RS8","333MSKG3","RS8",131.30000000000001,131.30000000000001,131.30000000000001,393.90000000000003,3,1,20,"D","E","333RS8M SKG3     ",null,null,null,null,null,null,null,null,null,null,null,null,null,null,null,null,null,null,null,null,"B",null,null,null,null,null,null,"M",null,null,14]
["333MT|RS8","333MT","RS8",131.9,131.9,131.9,395.70000000000005,3,1,3,"D","E","333RS8M","B_FUNKTIONEN","FUT","","","","","","","","","","","","","","","","","","","B",null,null,null,null,null,null,"M",null,null,15]
["333MTSKG3|RS8","333MTSKG3","RS8",138.76,138.76,138.76,416.28,3,1,3,"D","E","333RS8M SKG3","B_FUNKTIONEN","FUT","","","","","","","","","","","","","","","","","","","B",null,null,null,null,null,null,"M",null,null,17]
["333MFRL|RS8","333MFRL","RS8",134.63,134.63,134.63,403.89,3,1,0,"D","E","333RS8M FRL","","","","","","","","","","","","","","","","","","","","","B","x",null,null,null,null,null,"M",null,null,18]
["333MFRLSKG3*|RS8","333MFRLSKG3*","RS8",141.49,141.49,141.49,424.47,3,1,0,"D","E","333RS8M FRL ",null,null,null,null,null,null,null,null,null,null,null,null,null,null,null,null,null,null,null,null,"B",null,null,null,null,null,null,"M",null,null,20]
["333HFRL|RS8","333HFRL","RS8",94.71,94.71,94.71,284.13,4,4,0,"H","E","333RS8H FRL","","","","","","","","","","","","","","","","","","","","","B","x",null,null,null,null,null,"M",null,null,24]
["333HFRLSKG2|RS8","333HFRLSKG2","RS8",101.57,101.57,101.57,304.70999999999998,4,4,0,"H","E","333RS8H FRL SKG2","","","","","","","","","","","","","","","","","","","","","B","x",null,null,null,null,null,"M",null,null,25]
["333MH|RS8","333MH","RS8",111.99,111.99,111.99,335.96999999999997,17,4,0,"H","E","333RS8HM","","","","","","","","","","","","","","","","","","","","","B","x",null,null,null,null,null,"M",null,null,27]
["333MHSKG3|RS8","333MHSKG3","RS8",118.85,118.85,118.85,356.54999999999995,17,4,8,"H","E","333RS8HM SKG3","","","","","","","","","","","","","","","","","","","","","B","x",null,null,null,null,null,"M",null,null,29]
["333MHFRL|RS8","333MHFRL","RS8",122.18,122.18,122.18,366.54,17,4,0,"H","E","333RS8HM FRL","","","","","","","","","","","","","","","","","","","","","B","x",null,null,null,null,null,"M",null,null,30]
["333MHFRLSKG3*|RS8","333MHFRLSKG3*","RS8",129.04,129.04,129.04,387.12,17,4,0,"H","E","333RS8HM FRL ","","","","","","","","","","","","","","","","","","","","","B","x",null,null,null,null,null,"M",null,null,32]
["333K1|RS8","333K1","RS8",104.83,104.83,104.83,314.49,1,1,20,"D","E","333RS8","B_KNAUFAUSF","KNK1","","","","","","","","","","","","","","","","","","","B",null,null,null,null,null,null,"M",null,null,36]
["333K1SKG2|RS8","333K1SKG2","RS8",111.69,111.69,111.69,335.07,1,1,20,"D","E","333RS8 SKG2       ","B_KNAUFAUSF","KNK1",null,null,null,null,null,null,null,null,null,null,null,null,null,null,null,null,null,null,"B",null,null,null,null,null,null,"M",null,null,37]
["333K2|RS8","333K2","RS8",104.83,104.83,104.83,314.49,1,1,20,"D","E","333RS8","B_KNAUFAUSF","KNK2","","","","","","","","","","","","","","","","","","","B",null,null,null,null,null,null,"M",null,null,39]
["333K2SKG2|RS8","333K2SKG2","RS8",111.69,111.69,111.69,335.07,1,1,20,"D","E","333RS8 SKG2       ","B_KNAUFAUSF","KNK2",null,null,null,null,null,null,null,null,null,null,null,null,null,null,null,null,null,null,"B",null,null,null,null,null,null,"M",null,null,40]
["333K3|RS8","333K3","RS8",104.83,104.83,104.83,314.49,1,1,20,"D","E","333RS8","B_KNAUFAUSF","KNK3",null,null,null,null,null,null,null,null,null,null,null,null,null,null,null,null,null,null,"B",null,null,null,null,null,"D","M",null,null,42]
["333K3SKG2|RS8","333K3SKG2","RS8",111.69,111.69,111.69,335.07,1,1,20,"D","E","333RS8 SKG2       ","B_KNAUFAUSF","KNK3",null,null,null,null,null,null,null,null,null,null,null,null,null,null,null,null,null,null,"B",null,null,null,null,null,null,"M",null,null,43]
["333K4|RS8","333K4","RS8",104.83,104.83,104.83,314.49,1,1,0,"D","E","333RS8","B_KNAUFAUSF","KNK4",null,null,null,null,null,null,null,null,null,null,null,null,null,null,null,null,null,null,"B",null,null,null,null,null,null,"M",null,null,45]
["333K4SKG2|RS8","333K4SKG2","RS8",111.69,111.69,111.69,335.07,1,1,0,"D","E","333RS8 SKG2       ","B_KNAUFAUSF","KNK4",null,null,null,null,null,null,null,null,null,null,null,null,null,null,null,null,null,null,"B",null,null,null,null,null,null,"M",null,null,46]
["333K7|RS8","333K7","RS8",134.93,134.93,134.93,404.79,30,10,0,"D","E","333RS8 K7 SKG2",null,null,"","","","","","","","","","","","","","","","","","","B",null,null,null,null,null,null,"M",null,null,48]
["333K7SKG2|RS8","333K7SKG2","RS8",141.79,141.79,141.79,425.37,30,10,0,"D","E","333RS8 K7 SKG2",null,null,"","","","","","","","","","","","","","","","","","","B",null,null,null,null,null,null,"M",null,null,49]
["333K6KRU|RS8","333K6KRU","RS8",121.84,121.84,121.84,365.52,1,1,20,"D","E","333RS8KRU","B_KNAUFAUSF","KNK6","","","","","","","","","","","","","","","","","","","B",null,null,null,null,null,null,"M",null,null,50]
["333MK6|RS8","333MK6","RS8",130.65,130.65,130.65,391.95000000000005,3,1,20,"D","E","333RS8M","B_KNAUFAUSF","KNK6","","","","","","","","","","","","","","","","","","","B",null,null,null,null,null,null,"M",null,null,51]
["333MK6SKG3|RS8","333MK6SKG3","RS8",137.51,137.51,137.51,412.53,3,1,20,"D","E","333RS8M SKG3       ","B_KNAUFAUSF","KNK6",null,null,null,null,null,null,null,null,null,null,null,null,null,null,null,null,null,null,"B",null,null,null,null,null,null,"M",null,null,53]
["333MK7|RS8","333MK7","RS8",166.96,166.96,166.96,500.88,31,10,0,"D","E","333RS8M K7 SKG3",null,null,"","","","","","","","","","","","","","","","","","","B",null,null,null,null,null,null,"M",null,null,58]
["333MK7SKG3|RS8","333MK7SKG3","RS8",173.82,173.82,173.82,521.46,31,10,0,"D","E","333RS8M K7 SKG3",null,null,"","","","","","","","","","","","","","","","","","","B",null,null,null,null,null,null,"M",null,null,60]
["333KL|RS8","333KL","RS8",98.62,98.62,98.62,295.86,5,1,18,"D","E","333RS8KL",null,null,null,null,null,null,null,null,null,null,null,null,null,null,null,null,null,null,null,null,"B",null,null,null,null,null,null,"M",null,null,62]
["333KLK6|RS8","333KLK6","RS8",98.62,98.62,98.62,295.86,5,1,0,"D","E","333RS8KL","B_KNAUFAUSF","KNK6","","","","","","","","","","","","","","","","","","","B",null,null,null,null,null,null,"M",null,null,63]
["333KLT|RS8","333KLT","RS8",106.08,106.08,106.08,318.24,5,1,0,"D","E","333RS8KL","B_FUNKTIONEN","FUT","","","","","","","","","","","","","","","","","","","B",null,null,null,null,null,null,"M",null,null,65]
["333RI-10|RS8","333RI-10","RS8",117.09,117.09,117.09,351.27,1,1,0,"D","E","333RS8","B_MITNEHMERAUSF","MIRI10","","","","","","","","","","","","","","","","","","","B",null,null,null,null,null,null,"M",null,null,65.5]
["333RI-14|RS8","333RI-14","RS8",117.09,117.09,117.09,351.27,1,1,0,"D","E","333RS8","B_MITNEHMERAUSF","MIRI14","","","","","","","","","","","","","","","","","","","B",null,null,null,null,null,null,"M",null,null,65.599999999999994]
["555P|RS8","555P","RS8",84.52,84.52,84.52,253.56,0,4,0,"H","E","555RS8","B_AUSFUEHRUNG_ROHR_PLATTE","RPP","","","","","","","","","","","","","","","","","","","B","x",null,null,null,null,null,"M",null,null,69]
["555PSKG2|RS8","555PSKG2","RS8",91.38,91.38,91.38,274.14,0,4,0,"H","E","555RS8 SKG2       ",null,null,null,null,null,null,null,null,null,null,null,null,null,null,null,null,null,null,null,null,"B",null,null,null,null,null,null,"M",null,null,70]
["325L|RS8","325L","RS8",84.52,84.52,84.52,253.56,0,1,0,"H","E","325RS8 ","B_AUSFUEHRUNG_325","LIPS",null,null,null,null,null,null,null,null,null,null,null,null,null,null,null,null,null,null,"B",null,null,null,null,null,null,"M",null,null,71]
["325L/1754DR1|RS8","325L/1754DR1","RS8",276.72000000000003,276.72000000000003,276.72000000000003,830.16000000000008,0,1,0,"H","E","325RS8 ","B_AUSFUEHRUNG_325","LIPS",null,null,null,null,null,null,null,null,null,null,null,null,null,null,null,null,null,null,"B",null,null,null,null,null,null,"M",null,null,72]
[{"$f":"CONCATENATE(B707,\"|\",C707)","v":"325L/1754DR2|RS8"},"325L/1754DR2","RS8",276.72000000000003,276.72000000000003,276.72000000000003,830.16000000000008,0,1,0,"H","E","325RS8 ","B_AUSFUEHRUNG_325","LIPS",null,null,null,null,null,null,null,null,null,null,null,null,null,null,null,null,null,null,"B",null,null,null,null,null,null,"M",null,null,73]
["325/464|RS8","325/464","RS8",111.03,111.03,111.03,333.09000000000003,0,0,0,"H","E","325RS8 3464",null,null,null,null,null,null,null,null,null,null,null,null,null,null,null,null,null,null,null,null,"B",null,null,null,null,null,null,"M",null,null,74]
["777G3|RS8","777G3","RS8",127.42,127.42,127.42,382.26,0,0,21,"H","E","777RS8G3",null,null,null,null,"","","","","","","","","","","","","","","","","B","x",1,null,null,null,null,"M",null,null,75]
["777G3-HB60|RS8","777G3-HB60","RS8",139.28,139.28,139.28,417.84000000000003,0,0,21,"H","E","777RS8G3","B_BUEGELLAENGE","BU60",null,null,"","","","","","","","","","","","","","","","","B","x",1,null,null,null,null,"M",null,null,76]
["777G3-HB120|RS8","777G3-HB120","RS8",142,142,142,426,0,0,21,"H","E","777RS8G3","B_BUEGELLAENGE","BU120",null,null,"","","","","","","","","","","","","","","","","B","x",1,null,null,null,null,"M",null,null,77]
["382LI|RS8","382LI","RS8",84.52,84.52,84.52,253.56,0,4,4,"H","E","382RS8","B_TEILENR_HEBEL_10_8_BAU","200013F013","B_AUSFUEHRUNG_LI_RE","AGLI","","","","","","","","","","","","","","","","","B","x",null,null,null,null,null,"M",null,null,78]
["382RE|RS8","382RE","RS8",84.52,84.52,84.52,253.56,0,4,4,"H","E","382RS8","B_TEILENR_HEBEL_10_8_BAU","200013F013","B_AUSFUEHRUNG_LI_RE","AGRE","","","","","","","","","","","","","","","","","B","x",null,null,null,null,null,"M",null,null,79]
["393|RS8","393","RS8",103.28,103.28,103.28,309.84000000000003,0,4,5,"H","E","393RS8",null,null,"","","","","","","","","","","","","","","","","","","B","x",null,null,null,null,null,"M",null,null,80]
["464/325-L|RS8","464/325-L","RS8",111.03,111.03,111.03,333.09000000000003,0,4,19,"H","E","3464RS8","B_AUSFUEHRUNG_LI_RE","AGLI",null,null,null,null,null,null,null,null,null,null,null,null,null,null,null,null,null,null,"B","X",null,null,null,null,null,"M",null,null,82]
["464/325-R|RS8","464/325-R","RS8",111.03,111.03,111.03,333.09000000000003,0,4,19,"H","E","3464RS8","B_AUSFUEHRUNG_LI_RE","AGRE","","","","","","","","","","","","","","","","","","","B","x",null,null,null,null,"H","M",null,null,83]
["3020/473|RS8","3020/473","RS8",112.49,112.49,112.49,337.46999999999997,0,0,0,"H","E","3020/473RS8","B_RUNDMUTTER_3020","217060","B_TNR_FUEHRUNGSDUEBEL_BAUZYL","217128F","B_TNR_SCHLIESSBLECH_BAUZYL","222750 002","B_TNR_WERKZEUG_BAUZYLINDER","204271 002",null,null,null,null,null,null,null,null,null,null,null,null,"B",null,null,null,null,null,null,"M",null,null,84]
["3020/473 ESP|RS8","3020/473 ESP","RS8",112.49,112.49,112.49,{"$f":"D718+E718+F718","v":337.46999999999997},0,0,0,"H","E","3020/473RS8","B_RUNDMUTTER_3020","217060","B_TNR_DREHSTANGE_BAUZYL","205185 001","B_TNR_ANSCHLAGSTIFT_BAUZYL","207257F002","B_TNR_SCHLIESSHAKEN_BAUZYL","204476F002","B_TNR_SCHLIESSHAKEN_2_BAUZYL","204478F002","B_TNR_SCHLAUFEN_UNTERTEIL","218420F002","B_TNR_SCHLAUFEN_OBERTEIL","218418F002","B_TNR_SCHLIESSBLECH_BAUZYL","222750 002","B_TNR_FUEHRUNGSDUEBEL_BAUZYL","217128F","B_TNR_BUCHSE_DREHSTANGE","218422F036","B",null,null,null,null,null,null,"M",null,null,85]
["3020/4015|RS8","3020/4015","RS8",112.49,112.49,112.49,337.46999999999997,0,0,0,"H","E","3020/4015RS8","B_RUNDMUTTER_3020","217060","B_TNR_FUEHRUNGSDUEBEL_BAUZYL","217128F","B_TNR_SCHLIESSBLECH_BAUZYL","222750 002","B_TNR_WERKZEUG_BAUZYLINDER","204271 002",null,null,null,null,null,null,null,null,null,null,null,null,"B",null,null,null,null,null,null,"M",null,null,86]
["3020/4015 ESP|RS8","3020/4015 ESP","RS8",112.49,112.49,112.49,337.46999999999997,0,0,0,"H","E","3020/4015RS8","B_RUNDMUTTER_3020","217060","B_TNR_DREHSTANGE_BAUZYL","205185 001","B_TNR_ANSCHLAGSTIFT_BAUZYL","207257F002","B_TNR_SCHLIESSHAKEN_BAUZYL","204476F002","B_TNR_SCHLIESSHAKEN_2_BAUZYL","204478F002","B_TNR_SCHLAUFEN_UNTERTEIL","218420F002","B_TNR_SCHLAUFEN_OBERTEIL","218418F002","B_TNR_SCHLIESSBLECH_BAUZYL","222750 002","B_TNR_FUEHRUNGSDUEBEL_BAUZYL","217128F","B_TNR_BUCHSE_DREHSTANGE","218422F036","B",null,null,null,null,null,null,"M",null,null,87]
["|RS8",null,"RS8",0,0,0,0,0,0,0,null,"E","235271",null,null,null,null,null,null,null,null,null,null,null,null,null,null,null,null,null,null,null,null,"B",null,null,null,null,null,null,"M"]

{"sheet":"Sprachen","index":14,"n_rows":185,"n_cols":5,"rows_kept":185,"cut":false,"hidden":true,"merged":[]}
["ID","DE","GB","FR","NL"]
[1,"Deutsch","English","Français","Nederlands"]
[2,"S-Plan speichern unter","Save MK-plan as","Enregistrer sous","Sluitplan opslaan als.."]
[3,"Dateiname/Projekt","File name / Project","Nom du fichier/Projet","Bestand/ projectnaam"]
[4,"Schließplan bearbeiten","Edit Masterkey Plan","Éditer le plan","Sluitplan bewerken"]
[5,"Kalkulieren (F4) ...","Calculate (F4) ...","Calcul du Prix (F4) ...","Prijs ..."]
[6,"Fachhändler","Customer","Revendeur","Klant"]
[7,"Kundennummer","Customer No.","N° de client","Klantnummer"]
[8,"Telefon","Telefon","Téléphone","Telefoon"]
[9,"Ansprechpartner","Respond partner","Contact","Contactpersoon"]
[10,"Straße","Road","Rue","Straat"]
[11,"Land","Country","Pays","Postcode"]
[12,"Postleitzahl","Postcode","Code postal","Woonplaats"]
[13,"Ort","City","Ville","Provincie"]
[14,"Objekt","Object","Objet/Organigr.","Project"]
[15,"Kommission","Commission","Référence cde","Referentie"]
[16,"Wunschtermin","Term of delivery","Délais"]
[17,"Abweichende Lieferanschrift","Special delivery adress","Adresse de livraison complémentaire","Afwijkend leveradres"]
[18,"Name 1","Name 1","Nom 1","Naam 1"]
[19,"Name 2","Name 2","Nom 2","Naam 2"]
[20,"Ortsteil","District","Lieu"]
[21,"Besondere Hinweise","Special Hints","Remarque particulière","Bijzonderheden 2"]
[22,"Titel","Titel","Titre","Titel"]
[23,"Sicherungskarte","Security card","Carte de propriété","Veiligheidscertificaat"]
[24,"Anlagennummer","System code","Code organigramme","Sluitplannummer"]
[25,"Anlagenart","Type of System","Type d'organigramme","Inrichting"]
[26,"System","System","Système","Systeem"]
[27,"Kartennummer","No. of security card","N° de carte","Kaartnummer"]
[28,"Karte eingelesen am","S.-card reading date","Carte lu le","Kaart ingelezen op.."]
[29,"Karte einlesen","Reading card","Lecture de la carte","Kaart inlezen"]
[30,"Zurücksetzen","Reset data","Réinitialiser","Terug"]
[31,"Anschluß des Kartenlesers","Card reader connection","Port du lecteur de carte ","Aansluiting kaartlezer"]
[32,"Tastaturleser (z.B.MAGTEC)","Keybordreader (MAGTEC)","clavier (MAGTEC)","kaartlezer (MAGTEC)"]
[33,"Daten der Sicherungskarte","Security card data","Données de la carte de propriété","Gegevens van het Veiligheidscertificaat"]
[34,"Neuanlage","New System","Nouvel organigramme","Nieuw sluitsysteem"]
[35,"Erweiterung","Extension","Extension","Uitbreiding"]
[36,"Funktion","Function","Fonction","Functie"]
[37,"Nummer","Number","Numéro","Nummer"]
[38,"Bezeichnung","Marking","Description","Omschrijving"]
[39,"Anzahl","Quantity","Quantité","Aantal"]
[40,"Pos","Pos","Lg","Positie"]
[41,"Status","State","état","Status"]
[42,"Tür.-Raumbez.","Door/room-description","Désignation/porte","Deur-Ruimteomschrijving"]
[43,"Schlüssel-Nr.","Key.-No.","N° de clé","Sleutelnummer"]
[44,"Freie Eingabe","Free input","Saisie libre","Vrije invoer"]
[45,"Zyl.","Cyl.","Cyl.","Cil."]
[46,"Sch","Key","Clé","Sl."]
[47,"Zylindertyp","Cylinder type","Type","Cilindertype"]
[48,"Ausführung","Design","Fonctions","Uitvoering"]
[49,"Länge (A / B)","Length (A / B)","longueurs (A/B)","Lengte (A / B)"]
[50,"Farbe","Color","Finition","kleur"]
[51,"Keine Gruppenspalte","column not defined for groups","Pas de colonne de passe","Geen groepenkolom"]
[52,"Gruppennummer fehlt","masterkey number missing ","N° de passe inexistant","Groepennummer ontbreekt"]
[53,"Schlüsselnummer fehlt bei Pos","Key number missing in position","N° de clé inexistant","Sleutelnummer ontbreekt bij positie"]
[54,"In dieser Zeile/Spalte ist keine weitere Z/M-Funktion möglich","No more Z/M-function not possible","Impossible d'insérer 1 fonction d'OC suppl.","In deze rij/ kolom is geen Z/M functie meer mogelijk"]
[55,"Schlüsselnummer für Zentralzylinder muß mit \"Z...\" beginnen","Key number for Centralcylinder must start with \"Z...\"","Les n° d' ouvertures centrales doivent commencer par \"Z….\"","Sleutelnummer voor Centraalcilinder moet met \"Z..\" beginnen"]
[56,"Z/M-Funktion kann nicht überschrieben werden","Overwrite Z/M not possible","La Fonction OC ne peut être modifiée","Z/M functie kan niet overschreven worden"]
[57,"Keine Z oder M-Spalte","No Z or M row","Pas de colonne d'OC","Geen Z of M-kolom"]
[58,"G-Funktion bereits in Zeile vorhanden oder Schließfunktionen (X/I) ungleich","G-function already exist or different X/I function.",null,"G functie reeds in regels beschikbaar of sluitfuncties X/I ongelijk"]
[59,"Max eine Mitschließung möglich","Max one I-Funktion","Une entrouverture max. possible !","Maximaal 1 meesluiting mogelijk"]
[60,"Gruppen","Master key","Passes","Groepenfunctie"]
[61,"Schl.-Nummer","MK number","N° de clé","Sleutelnummer"]
[62,"Bezeichnung","Marking","Désignation","Omschrijving"]
[63,"Anz.","Quant.","Quantité","Aantal"]
[64,"Typ","Type","Type","Type"]
[65,"Keine Guppen bei dieser Anlagenart möglich","No masterkeys possible in type of system","Pas de passe disponible dans ce type d'organigramme","In deze inrichting (Z) is geen groepenindeling mogelijk"]
[66,"Speichern","Save","Enregistrer","Opslaan"]
[67,"Löschen","Delete","Supprimer","Wissen"]
[68,"Maximale Gruppenanzahl bei Anlagenart ZHS: 1","Max. Masterkeys in type ZHS: 1 ","En mode ZHS, nombre de passe max.: 1","Maximaal aantal groepen in een ZHS- inrichting: 1"]
[69,"Maximale Gruppenanzahl bei Anlagenart HS: 2 (HS + HS-T)","Max. Masterkeys in type HS: 2 ","En mode HS, nombre de passe max.: 1","Maximale groepenaantal in een HS- inrichting: 2 (HS + HS-TD)"]
[70,"Bitte Schlüsselnummer,  Typ und Neu oder Bestehend angeben.","Please input Masterkey number, type and new or existing group.","Veuillez indiquer le n°de clé, le type ou l'état ","Sleutelnummer, type, nieuw of bestaand aangeven a.u.b."]
[71,"Schlüsselnummer bereits vorhanden","Keynumber already exists","N° de clé déjà existant","Sleutelnummer is reeds bekend"]
[72,"Bearbeiten ...","Edit ...","Éditer ...","Bewerken ..."]
[73,"Spalte(n) hinzufügen","Add column(s)","Insérer colonne(s)","Kolom invoegen"]
[74,"Spalte(n) löschen","Delete column(s)","Supprimer colonne(s)","Kolom verwijderen"]
[75,"Zeile(n) hinzufügen","Add row(s)","Insérer ligne(s)","Regel invoegen"]
[76,"Zeile(n) löschen","Delete row(s)","Supprimer ligne(s)","Regel verwijderen"]
[77,"Spalten","Columns","Colonne","Kolommen"]
[78,"Zeilen","Rows","Ligne","Regels"]
[79,"Bearbeitet werden die ausgwählten Zeilen oder Spalten.","Eding the selected row/columns","Édition des lignes ou colonnes sélectionnées","De geselecteerde regels of kolommen worden bewerkt"]
[80,"Schließen","Close","Quitter","Sluiten"]
[81,"Bitte lesen Sie die Sicherungskarte in den Kartenleser ein. Danach OK drücken","Please input security card and then OK.","Insérer SVP la carte de propriété dans le lecteur puis cliquer sur OK","Het veiligheidscertificaat door de kaartlezer halen. Daarna op OK drukken"]
[82,"Eine bestehende Funktion soll geändert werden. Dies ist in der Regel nicht möglich. Trotzdem ändern?","You try to change an existing Funktion. Mostly not possible. Nevertheless change? ","Une fonction existante doit être modifiée. Ce n'est pas pas possible normalement. Continuer ?","Een bestaande functie moet gewijzigd worden.Dit is in het principe niet mogelijk. Toch veranderen?"]
[83,"Typen OK","Cylinder typ OK","Types OK","Types zijn OK"]
[84,"Typen fehlerhaft","Cylinder typ not correct.","Types erronés","Types foutmelding"]
[85,"Typen prüfen","Check types.","Contrôle des types","Types controleren"]
[86,"Preisvorgaben","Prices","Calcul des prix","Prijsopgave"]
[87,"Multi %","Multi %","% Multi","Korting %"]
[88,"BAZ (<=10Zyl.) %","<=10 cyl. %","<10 pièces","Uitbreidingstoeslag %"]
[89,"Altanlage %","Old system %","% anc.plan","Ouderdomstoeslag"]
[90,"Zuschlag 1 %","Add 1 %","% Plus-value 1","Toeslag 1 %"]
[91,"Zuschlag 2 %","Add 2 %","% Plus-value 2","Toeslag 2 %"]
[92,"Abschlag 1 %","minus 1 %","% Remise 1","Korting 1 %"]
[93,"Abschlag 2 %","minus 2 %","% Remise 2","Korting 2 %"]
[94,"Massen anzeigen","Show","Voir","Prijzen bekijken"]
[95,"MwSt. %","Tax %","% TVA","BTW %"]
[96,19,null,19.600000000000001,21]
[97,"zus. Einzelschlüssel","additional keys","Clés supplémentaires","Extra monosleutels"]
[98,"Einzelschl. ohne Zylinder","Existing Keys","Clé sans cylindre","Monosleutels zonder cilinder"]
[99,"Neue GS/HS-Schlüssel","New MK","Nouveau Passe (PG seul ou PP )","Nieuwe GS/HS sleutels"]
[100,"Best. GS/HS-Schlüssel","Existing MK","Passe existant (PG seul ou PP)","Bestaande GS/HS sleutels"]
[101,"Neue GHS-Schlüssel","New GMK","Nouveau Passe (PPG)","Nieuwe GHS sleutels"]
[102,"Best. GHS-Schlüssel","Existing GMK","Passe existant (PPG)","Bestaande GHS sleutels"]
[103,"Neue G-Schlüssel","New G","Nouvelle clé G","Nieuwe G sleutel"]
[104,"Best. G-Schlüssel","Existing G","Clé G éxistante ","Bestaande G sleutel"]
[105,"Gesamt","Total","Total","Totaal"]
[106,"Anz. VL","Quant. Length","Qté de rallongements","Aantal verlengingen"]
[107,"Summe","Sum","Total","Totaal"]
[108,"Preis","Price","Prix","Prijs"]
[109,"Einzelpreis","Single Price","Prix unitaire","Stuksprijs"]
[110,"Preisliste","Price list","Liste de prix","Prijslijst"]
[111,"Planung","Planing","Prévision","Planning"]
[112,"N =Neu","N = New","N=Nouveau","N= Nieuw"]
[113,"B = Bestehend","B = Exist","B=Existant","B= Bestaand"]
[114,"Import ab Pos.","Import to Pos.","Importer de lg.","Import vanaf positie"]
[115,"Spalte(n) Import","Columns import","Importer colonne(s)","Import van kolom(men)"]
[116,"Bitte Funktionsart wählen. X, Z, M, I, G","Choose kind of Function. X, Z, M, I, G","Choisir, SVP, le type de fonction (X, Z, M, I, G)","Kies uit functie: X, Z, M, I, G"]
[117,"Sicherungkarte paßt nicht zur Anlagennummer!!!","Security card data not equal to system code","Carte incompatible avec l'organigramme","Veiligheidscertificaat komt niet overeen met Sluitsysteemnummer"]
[118,"Unverbindliche Preisermittlung auf der Grundlage der o.g. Vorgaben.",null,"Ce devis est calculé à titre indicatif et n´a pas de valeur contractuelle.","Prijsindicaties van het systeem zijn onder voorbehoud van een correcte invoer"]
[119,"Bitte beachten Sie die Preise unserer Auftragsbestätigung.",null,"Le prix vous sera confirmé par le service d'administration des ventes.","Let U a.u.b. op de prijzen die vermeld staan op de opdrachtbevestiging"]
[120,"Diese Preisermittlung wird beim verlassen der Tabelle gelöscht.",null,"Ce calcul de prix sera supprimé en quittant ce tableau","Deze prijsopgaaf wordt bij het verlaten van dit tabblad gewist"]
[121,"Schlüssel","Keys","Clé","Sleutel"]
[122,"Zylinder","Cylinders","Cylindre","Cilinder"]
[123,"Duplizieren mit \"@\"","duplicate  with \"@\"","Dupliquer avec \"@\"","Kopie met \"@\""]
[124,"Startnummer für \"@\"","Start number for \"@\"","1er numéro","Start nummer"]
[125,"Anzahl der Kopien","Copys count","Nombre de copie","Aantal copys"]
[126,"Wertehilfe für Typ, Ausf., Länge und Farbe mit \"F1\"","Input help for types, design, length and color with \"F1\"","Aide pour le Type, Fonction, longueurs et Finition avec \"F1\""]
[127,"Lesefehler","reading error","Erreur de lecture","Error inlezen"]
[128,"Nur neue Positionen ohne Status","Only new positions with no status","Uniquement les positions en extension","Nieuwe positions zonder status"]
[129,"Drucken","Print","Imprimer","Drukken"]
[130,". (Punkt) bitte nicht verwenden.","Please do not use \".\" (Full stop)",". ! Merci de ne pas utiliser le point","\".\" - Nummer Error"]
[131,"Fester Aufschag je Zylinder","Text 131","Plus-value / cyl.","Toeslag per cylinder"]
[132,"Fehler  Daten Typ bei Abzug je Zylinder","Text 132","Erreur Data-Type - Remise par cylindres","Error - Korting per cilinder"]
[133,"Sortieren nach Spalte ","Sort by column ","trier colonne ","Sort by column "]
[134,"Der Schließplan ist auf max. 5000 Zeilen begrenzt.","Maximally 5000 rows","Au maximum 5000 lignes","Maximaal 5000 regel"]
[135,"Anzahl Sonderspalten. Werden wie die \"Freie Eingabe\" nicht in DOM-Plan übernommen","Special Columns","Colonne spécialement","Speciaal Kolommen"]
[136,"Schüsselnummer mehrfach vorhanden. Funktion wird für alle Positionen übernommen.","Keynumber already exists. Existing positions get the new funktion. ","N° de clé déjà existant. La nouvelle fonction est prise en charge.","Sleutelnummer komt voor op meerdere posities.Functie wordt op al deze posities overgenomen.\n"]
[137,"!!Nicht im DOM-Plan!!","!!Not in DOM-MK-Plan!!","!!Pas dans le DOM l'organigramme!!","!!Niet in DOM-plan!!"]
[138,"Typenbezeichnung","Type designation","Dénomination du type"]
[139,"GHS","MKS","PPG","GHS"]
[140,"HS","MK","PG","HS"]
[141,"ZHS","CMK","CPG","ZHS"]
[142,"Z","CC","C","Z"]
[143,"?","?","?","?"]
[144,"Profilserie"]
[145,"Zentralzyl. I in Z","central cylinder","centrales","Centraalcilinder Z"]
[146,"Z-Funktion I in Z","central function","function centrales","Centraalfunctie I"]
[147,"Schlüsselnummer für Zentralzylinder muß mit \"C...\" beginnen","Key number for Centralcylinder must start with \"C...\"","Les n° d' ouvertures centrales doivent commencer par \"C….\"","Sleutelnummer voor Centraalcilinder moet met \"C..\" beginnen"]
[148,"GS","SMK","SPG","GS"]
[149,"Eingang","entrance","contribution","invoer"]
[150,"Haupteingang","Main entrance","entrée principale","hoofdingang"]
[151,"Nebeneingang","side entrance","entrée latérale","zijingang"]
[152,"Fahrradkeller","Bicycle storage","Garage à vélos","fietsenstalling"]
[153,"Hausanschlussraum","Building connection room","Bâtiment salle de connexion","Gebouw verbinding room"]
[154,"Heizung","heating","chauffage","verwarming"]
[155,"Müll","trash","déchets","afval"]
[156,"Wohnung","apartment","appartement","appartement"]
[157,"Keller","cellar","cave","kelder"]
[158,"Briefkasten","mailbox","boîte aux lettres","brievenbus"]
[159,"Garage","garage","garage","garage"]
[160,"WC","WC","toilettes","WC"]
[161,"WC Damen","WC Women","WC Femmes","WC Vrouwen"]
[162,"WC Herren","WC Men","WC hommes","WC Men"]
[163,"Büro","office","bureau","kantoor"]
[164,"Vorraum","anteroom","antichambre","voorkamer"]
[165,"Durchgang","passage","passage","passage"]
[166,"Geschäftsleitung","Management","gestion","beheer"]
[167,"Personalabteilung","personnel department","service du personnel","personeelsdienst"]
[168,"Konstuktion","Architectural Technology","technologie de l'architecture","Architectural Technology"]
[169,"Verkauf","sale","vente","verkoop"]
[170,"Produktion","production","production","productie"]
[171,"Halle","Hall","hall","hal"]
[172,"IT","IT","IT","IT"]
[173,"Server","server","serveur","server"]
[174,"EDV","it","IT","IT"]
[175,"Vertrieb","distribution","ventes","verkoop"]
[176,"Export","export","exportation","export"]
[177,"Technik","technology","technologie","technologie"]
[178,"Systeme für Neuanlagen","New systems","Nouveaux systèmes","Nieuwe systemen"]
[179,"Sonstige Systeme","Other systems","D'autres systèmes","Overige systemen"]
[180,"Händlerprofile","Lochsmith profiles","Revendeur profil","Eigen profielen"]
[181,"?","?","?","Netto totaalbedrag excl.BTW"]
[182,"?","?","?","Meesluiting"]
[183,"?","?","?","Nieuw / uitbreiding …"]
[184,"Straße","Road","Rue","Versienummer"]

{"sheet":"Schlüssel","index":15,"n_rows":1,"n_cols":9,"rows_kept":1,"cut":false,"hidden":true,"merged":[]}
["Gruppenschlüssel","Schließplan","Nachlieferung","Gesamt",null,"Einzelschlüssel","Schließplan","Nachlieferung","Gesamt"]

{"sheet":"Hilfe-DE","index":16,"n_rows":98,"n_cols":1,"rows_kept":98,"cut":false,"hidden":true,"merged":[[2,0,2,11],[4,0,4,11],[6,0,6,11],[40,0,40,11],[24,0,24,11],[23,0,23,11],[8,0,8,11],[16,0,16,11],[18,0,18,11],[79,0,79,11],[38,0,38,11],[25,0,25,11],[39,0,39,11],[75,0,75,11]]}
[]
[]
["DOM-XL"]
[]
["DOM - Sicherheitstechnik GmbH , 50309 Brühl"]
[]
["Tel: 02232/ 704-0"]
[]
["Bitte senden Sie uns den fertigen DOM-XL-Schließplan per E-Mail, Diskette oder CD-ROM. "]
[]
["Anleitung:"]
[]
["Nach dem Lesen der folgenden Zeilen sind Sie in der Lage, mit DOMXL Schließanlagen schnell zu erfassen und vorab zu kalkulieren."]
[]
["Start"]
[]
["1. Öffnen Sie die Datei DOMXL.XLT. Beim Öffnen werden Sie gefragt ob Sie \"Makros aktivieren\" möchten. Diese Frage müssen Sie mit \"Ja\" beantworten, um die Datei mit voller Funktionalität zu öffnen. Sollte diese Frage nicht gestellt werden, müssen Sie in Excel unter \"Extras>Macro>Sicherheit\" die Sicherheitsstufe auf \"Mittel\" oder \"Niedrig\" einstellen. Danach schließen Sie Excel und starten Excel neu."]
["2. Füllen Sie, soweit bekannt, die Felder im Tabellenblatt \"Start\" aus."]
["3. Wenn Sie einen Magnetkartenleser besitzen und zu einer bestehenden Schließanlage eine Erweiterung erfassen wollen, klicken Sie auf \"Sicherungskarte\". In der nächsten Maske stellen Sie den Anschluss Ihres Kartenlesers ein und wählen \"Karte einlesen\". Nachdem die Karte in den Leser eingelesen wurde wählen Sie \"OK\"."]
["4. Über \"Schließplan bearbeiten\" oder F3 gelangen Sie zum Schließplan."]
[]
["Schließplan"]
[]
["1. Soweit die Felder noch nicht durch die Sicherungskarte gefüllt wurden, machen Sie Angaben zu \"Neuanlage/Erweiterung\", \"Anlagennummer\", \"Anlagenart\" und \"System\"."]
["2. Erfassen Sie die Spalten \"Raumbezeichnungen\", \"Freie Eingabe\" und \"Schlüsselnummer\". Über den Schalter \"Bearbeiten>Spalten importieren\" (oder F8-Taste ) können externe Daten durch Kopieren über die Zwischenablage übernommen werden."]
["3. Füllen Sie die Felder \"Anzahl\", \"Zylindertyp\", \"Ausführung\", \"Länge\" und \"Farbe\" aus. Hier erhalten Sie mit der F1-Taste Hilfe über eine Auswahlliste gültiger Werte, die Sie durch Anklicken übernehmen können. "]
[]
["F1: Wertehilfe für Zylindertyp, Ausführung, Länge und Farbe."]
["F5: Übernimmt den Wert der darüberliegenden Zelle. "]
["F6: Übernimmt die darüberliegende Zeile komplett. "]
["F7: Übernimmt den rechten Rest der darüberliegenden Zeile."]
["F9: Fügt Zeile(n) ein. Diese Funktion ist auch unter dem Schalter \"Bearbeiten zu finden\"."]
["F10: Löscht Zeile(n). Diese Funktion ist auch unter dem Schalter \"Bearbeiten zu finden\"."]
["F11: Fügt Spalte(n) ein. Diese Funktion ist auch unter dem Schalter \"Bearbeiten zu finden\"."]
["F12: Löscht Spalte(n). Diese Funktion ist auch unter dem Schalter \"Bearbeiten zu finden\"."]
["Shift F5: Kopiert die markierten Werte einer Spalte und fügt sie unterhalb der Markierung ein. "]
["Shift F6: Kopiert den markierten Bereich und fügt ihn unterhalb der Markierung ein."]
[]
["4. Rot markierte Felder deuten darauf hin, dass hier noch eine Eingabe bzw. Änderung (z.B.: Andere Schreibweise, Ausführung nicht hinterlegt etc.) erforderlich ist.  "]
["5. Die Gruppenschlüssel werden durch Auswahl von Schlüsselnummer, -Bezeichnung oder -Typ im Schließplankopf erfasst und geändert. Achtung: Das Erfassungsfenster öffnet sich nur, wenn Sie die Auswahl wechseln. Mit Hilfe des \"@\"-Zeichens können Sie innerhalb GHS-Anlagen Gruppenschlüssel fortlaufend \"in einem Rutsch\" erfassen."]
["6. Die Funktionen werden durch Auswahl der \"Funktion\" und durch Anklicken der gewünschten Position in der Funktionsmatrix gesetzt. Zum Löschen von Funktionen müssen Sie in der Auswahl \"Funktion\" im Schließplankopf das Leerfeld wählen."]
["7. Über \"Preise\" oder über F4 kann nun anhand Ihrer Vorgaben eine Kalkulation vorgenommen werden."]
["8. Die Exportfunktionen dienen nur dem DOM-Datentransfer und sind für Sie als Fachhändler nicht von Bedeutung. "]
["9. Wenn Sie zusätzliche Spalten für Daten benötigen, dann können Sie diese unter \"Bearbeiten>Anzahl Sonderspalten\" sichbar machen. "]
[]
[]
["Funktionen"]
[]
["Kennzeichen in Auswahlliste \"Funktion\""]
["X = Gruppenfunktion"]
["Z = Zentralzylinder der von Einzelschlüsseln mit I-Kennzeichnung geschossen wird"]
["M=Mitschließung die von einer Einzelschließung mit I-Kennzeichnung geschlossen wird"]
["I   = schließt in Z oder M-Zylinder"]
["G = Gleichschließung (nur erforderlich wenn die Schlüsselnummern unterschiedlich sind)"]
["Leerfeld= Funktion löschen"]
[]
["Grundsätzliches"]
["Alle Schlüssel mit gleicher Schlüsselnummer könne alle Zylinder mit derselben Nummer schließen. "]
["Gleiche Schlüsselnummer bedeutet gleiche Schließfunktion von Schlüssel und Zylinder."]
[]
["Gruppenschlüssel schließen alle mit X gekennzeichneten Zylinder der Spalte."]
[]
["Zentralfunktionen: Alle mit I gekennzeichneten Positionen schließen in die mit Z gekennzeichneten Positionen einer Spalte"]
["Für jede Zentralschließung ist eine separate Spalte anzulegen."]
[]
["Mitschließungen: Alle mit I gekennzeichneten Positionen schließen in die mit M gekennzeichneten Positionen einer Spalte."]
["Maximal eine Schlüsselnummer kann eine andere mitschließen. "]
["Die Schließfunktionen beider Schlüsselnummern müssen ansonsten identisch sein."]
[]
["Gleichschließung: Hiermit werden Positionen mit unterschiedliche Schlüsselnummern"]
["jedoch identischen Schließfunktionen gekennzeichnet."]
["Achtung! Sollte nur in Ausnahmen verwendet werden."]
[]
["Preis"]
[]
["Die Preisermittlung erfolgt unverbindlich aufgrund Ihrer Vorgaben und der hinterlegten Preisliste. Die Preisvorgaben werden bei jedem Öffnen von DOMXL zurückgesetzt.Das bedeutet, dass Sie die Datei weitergeben können ohne Ihre Kalkulation preiszugeben. Zusätzlich können Sie ein Kennwort eingeben, um den Kalkulationsschalter zu deaktivieren. Gespeichert wir das Kennwort jeweils beim Anzeigen der Preise.  "]
[]
[]
[]
["Hinweis. DOMXL verhält sich im Wesentlichen so wie eine normale Exceltabelle. Da der Aufbau von DOMXL geschützt ist und im Hintergrund Plausibilitätsprüfungen stattfinden, kann es sein, dass einige \"normale Excelfunktionen\" nicht wie gewohnt möglich sind (z.B. Zeilen-Einfügen). Diese Funktionen sind durch DOMXL-eigene Funktionen ersetzt worden (z.B.F9 = Zeile(n) einfügen). "]
[]
["Für Fragen steht Ihnen "]
[]
["Herr Ulrich Stappenbeck "]
["Tel.:02232-704-404  "]
["E-Mail mailto:Ulrich.Stappenbeck@DOM-Sicherheitstechnik.de "]
["gerne zur Verfügung."]
[]
["DOMXL ist urheberechtlich geschützt."]
["Unbefugte Vervielfältigung, Weitergabe oder Änderung"]
["wird straf- und zivilrechtlich verfolgt."]
["und kann schwere Strafen und Schadendsersatzforderungen"]
["zur Folge haben."]
[]
["DOMXL ist Eigentum der"]
["DOM-Sicherheitstechnik GmbH"]
["Wesselinger Str. 10-16"]
["50321 Brühl"]

{"sheet":"Help-NL","index":17,"n_rows":124,"n_cols":7,"rows_kept":124,"cut":false,"hidden":false,"merged":[[58,1,58,9],[2,0,2,11],[4,0,4,11],[6,0,6,11],[8,0,8,11],[9,0,9,11],[54,1,54,9],[55,1,55,9],[56,1,56,9],[57,1,57,9],[70,1,70,9],[59,1,59,9],[60,1,60,9],[61,1,61,9],[62,1,62,9],[63,1,63,9],[64,1,64,9],[65,1,65,9],[66,1,66,9],[67,1,67,9],[68,1,68,9],[69,1,69,9],[108,1,108,9],[82,1,82,9],[72,1,72,9],[73,1,73,9],[74,1,74,9],[75,1,75,9],[76,1,76,9],[77,1,77,9],[78,1,78,9],[79,1,79,9],[80,1,80,9],[81,1,81,9],[99,1,99,9],[100,1,100,9],[101,1,101,9],[102,1,102,9],[107,1,107,9],[83,1,83,9],[92,1,92,9],[93,1,93,9],[94,1,94,9],[98,1,98,9],[118,0,118,11],[120,0,120,11],[121,0,121,11],[122,0,122,11],[109,1,109,9]]}
[]
[]
["DOM-XL"]
[]
["DOM Nederland"]
[]
["Tel: 070-3193006"]
[]
["Graag ontvangen wij uw sluitplanbestelling in DOM-XL per e-mail."]
["verkoop@dom-group.nl"]
["Bediening:"]
[]
["Na het lezen van deze beknopte handleiding bent U in staat om snel en eenvoudig een sluitplan op te stellen en vooraf een calculatie daarvan te maken."]
[]
[]
["Let op: "]
["Tekst in de ruimteomschrijving mag maximaal 30 tekens bevatten. "]
["Meer tekens zijn in het definitieve sluitplanoverzicht dan ook niet zichtbaar."]
["Tekst in \"vrije ruimte\" wordt niet weergegeven in het definitieve sluitplan."]
["Door op \"BEWERKEN\" of de <F8> toets te drukken, kunt U o.a. kolommen importeren van een extern bestand."]
[]
["Sneltoetsen"]
["   <F2>     laat de cursor zien   "]
["   <F3>     naar het sluitplan"]
["   <F4>     prijzen bekijken"]
["<F5>     kopieert de waarde van bovenliggende cel"]
["<F6>     kopieert de gehele bovenliggende regel"]
["<F7>     kopieert de bovenliggende regel behalve ruimteomschrijving en vrije invoer"]
["<F9>     invoegen van een regel"]
["<F10>   verwijderen van een regel"]
["<F11>   invoegen van een kolom"]
[]
[]
["Rood gemarkeerde cellen duiden erop dat U iets heeft ingevoerd wat niet juist is. Controleer de types, uitvoeringen en kleur."]
["Er is een speciaal invoerscherm beschikbaar om een (G)HS of GS in te voeren. Dit scherm komt tevoorschijn wanneer U klikt op een cel waar de"]
["GS sleutels behoren te staan."]
["Door eerst een functie te kiezen in het keuzemenu \"FUNCTIE\" kunt U deze functie in de juiste positie zetten in de functiematrix"]
["Dit kan op 2 manieren:"]
["Door een klik met de linker muisknop (1 voor 1)"]
["Door een bereik te selecteren (alles tegelijk)"]
[]
["Door op de knop \"PRIJZEN\" of <F4> te drukken kunt U de prijzen bekijken van uw zojuist opgestelde sluitplan"]
["(U krijgt eerst een invoerscherm waarin U een aantal gegevens zoals wachtwoord (passwort)/ kortingen/ toeslagen kunt vermelden)"]
[]
["Waar u op moet letten bij een ZHS systeem:"]
["U heeft gekozen voor een Z/ZHS inrichting. DOM XL bepaalt niet of de door u opgegeven inrichting juist is! "]
["De Hoofdsleutel in deze inrichting is een Technische Hoofdsleutel en mag ongeveer 30% van het plan sluiten! (centraalcilinders en technische ruimten)"]
["Controleer of u de juiste inrichting gekozen heeft."]
[]
["De Exportfunctie is voor DOM doeleinden bestemd en is voor U niet van toepassing."]
[]
["Omschrijving van cilindertypen:"]
[]
["Cilindertype","Omschrijving"]
["333","Dubbele Europrofielcilinder "]
["333SKG2","Dubbele Europrofielcilinder met SKG2 keurmerk"]
["333SKG3","Dubbele Europrofielcilinder met SKG3 keurmerk"]
["Zorgfunctie","Verschillende sluiting per zijde (tbv dubbele, symetrische, cilinder met T koppeling) Kies; cilindertype 333T, Zorgfunctie opgeven in kolom Uitvoering"]
["SEW","Zeewater bestendige uitvoering (in kleur 4, glans chroom afgewerkt met chemisch vernikkelde meenemer en stulpschroef van rein messing) opgeven in kolom Uitvoering"]
["333H","Halve Europrofielcilinder"]
["333HSKG2","Halve Europrofielcilinder met SKG2 keurmerk"]
["333HSKG3","Halve Europrofielcilinder met SKG3 keurmerk"]
["333K6","Dubbele Europrofielcilinder met knop (knopcilinder) ook leverbaar met K1, K2, K3 of K3 knopuitvoering"]
["333K6SKG2","Dubbele Europrofielcilinde rmet knop (knopcilinder) met SKG2 keurmerk, ook leverbaar met K1, K2, K3 of K4 knopuitvoering"]
["333K6SKG3","Dubbele Europrofielcilinder met knop (knopcilinder) met SKG3 keurmerk, ook leverbaar met K1, K2, K3 of K4 knopuitvoering"]
["333K7","Dubbele Europrofielcilinder met anti manipuleerbare knop "]
["333FRL","Dubbele Europrofielcilinder met vrijloopfunctie (360°)  FZG gecertificeerd"]
["333HFRL","Halve Europrofielcilinder met vrijloopfunctie (360°) FZG gecertificeerd"]
["**","Belangrijke informatie:"]
["**","ivm FZG certificering voor cilinders tbv vluchtwegen en motorsloten zijn de vrijloopcilinders in de profielen"]
["**","ix Teco, ix Twido, ix Twinstar, ix Gamma, ix(5)HT, ix 6SR en ix Saturn alleen leverbaar vanaf afmeting 35/35 voor dubbele cilinders en 0/35 voor halve cilinders"]
[null,"Deze systemen zijn in modulaire uitvoering (333M en 333MH) NIET met vrijloopfunctie leverbaar."]
["333T","Dubbele Europrofielcilinder voorzien van T-koppeling (gevarenfunctie) "]
["333M","Dubbele Europrofielcilinder in Modulaire constructie"]
["333MFRL","Dubbele Europrofielcilinder met vrijloopfunctie (360°) FZG gecertificeerd in Modulaire constructie (alleen conventioneel sleutelprofiel)"]
["333MH","Halve Europrofielcilinder in Modulaire constructie"]
["333MHFRL","Halve Europrofielcilinder met vrijloopfunctie 360° FZG gecertificeerd in Modulaire constructie (alleen conventioneel sleutelprofiel)"]
["333MK6","Dubbele Europrofielcilinder met knop (knopcilinder) in Modulaire constructie"]
["333K6KRU","Dubbele Europrofielcilinder met knop en slipkoppeling (knopzijde kan niet worden tegengehouden, toegang altijd mogelijk)"]
["333KL ","Dubbele Europrofielcilinder Kort-Lang (28/35 of 28/40) "]
["333KLK6","Dubbele Europrofielcilinder met knop (knopcilinder) Kort-Lang uitvoering (28/35 of 28/40) "]
["333KLT","Dubbele Europrofielcilinder Kort-Lang (28/35) voorzien van T-koppeling (gevarenfunctie)"]
["333RI (10/14)","Dubbele Europrofielcilinder met tandwiel (10 of 14 tands)"]
["333MT","Dubbele Europrofielcilinder in modulaire constructie voorzien van T-koppeling (gevarenfunctie) "]
["333STAALSKG3","Dubbele Europrofielcilinder tbv DOM Diamant, staal uitvoering, SKG3"]
["333TSTAALSKG3","Dubbele Europrofielcilinder tbv DOM Diamant, staal uitvoering, voorzien van T-koppeling (gevarenfunctie), SKG3"]
["333HSTAALSKG3","Halve Europrofielcilinder tbv DOM Diamant, staal uitvoering, SKG3 "]
["333K6STAALSKG3","Dubbele Europrofielcilinder met knop (knopcilinder) tbv DOM Diamant, staal uitvoering, SKG3"]
["333DUR","Dubbele Europrofielcilinder tbv DOM Diamant, duracast uitvoering (voor binnendeuren)"]
["333TDUR","Dubbele Europrofielcilinder tbv DOM Diamant, duracast uitvoering voorzien van T-koppeling (gevarenfunctie) voor binnendeuren"]
["333HDUR","Halve Europrofielcilinder tbv DOM Diamant, duracast uitvoering (voor binnendeuren)"]
["333K6DUR","Dubbele profielcilinder met knop tbv Diamant, duracast uitvoering (voor binnendeuren)"]
["555P","Staartcilinder (t.b.v. Lips 1700 series)"]
["325L","Binnencilinder t.b.v. LIPS 1754"]
["325L/1754DR1/DR2","Lips oplegslot 1754 (DM50mm) DR1 of DR2 icm 325L "]
["472","Dubbbele cilinder 22 mm rond "]
["472H","Halve cilinder 22 mm rond"]
["472K6","Dubbele cilinder met knop (knopcilinder) 22 mm rond"]
["382 LI/RE","Hevelcilinder (voor o.a. postkasten) Links/Rechts"]
["393","Cilinder voor lift sleutelschakelaar met aansluiting van 2 microschakelaars (schakelmoment kiezen in \"uitvoering\")"]
["419 Lips","Schroefcilinder tbv Lips 2300 serie"]
["325 / 464","Meubelkastcilinder tbv slotkast 464"]
["464 / 325","Meubelkastcilinder kompleet met slotkast (Doornmaat opgeven in \"uitvoering\")"]
["3020/473","Meubel/kastslot combinatie met cilinder (zonder stangen)"]
["3020/4015","Meubel/kastslot combinatie met knop/cilinder (zonder stangen)"]
["3020/473 ESP","Meubel/kastslot combinatie met cilinder en draaistangen (200cm) met toebehoren (espagnolet)"]
["3020/4015 ESP","Meubel/kastslot combinatie met knop/cilinder en draaistangen (200cm) met toebehoren (espagnolet)"]
["777G3","Hangslot incl. 333H -/30 cilinder"]
["777G3-HB60","Hangslot incl. 333H -/30 cilinder met hoge beugel 60mm"]
["777G3-HB120","Hangslot incl. 333H -/30 cilinder met hoge beugel 120mm"]
[]
["Let erop dat niet alle typen in alle systemen toepasbaar zijn!"]
[]
["DOM-XL is een databaseprogramma op Microsoft Excel basis en werkt hierdoor in het principe hetzelfde als een Excel spreadsheet."]
["Omdat DOM-XL beveiligd is en gebruik maakt van verborgen formulebladen, kan het zijn dat bepaalde \"gebruikelijke excelfuncties\""]
["niet functioneren zoals U dit gewend bent. (bijvoorbeeld: invoegen en verwijderen van regels en kolommen.) deze functies zijn nog steeds mogelijk, maar op een manier"]
["zoals beschreven in deze beknopte handleiding."]
[]
["Voor vragen kunt U zich richten tot:"]
[]
["Dom-Nederland"]
["verkoop@dom-group.nl"]
["070-3193006"]
[null,null,null,null,null,null,"De meest recente versie van DOM XL download u van onze  website"]

{"sheet":"grund","index":18,"n_rows":66,"n_cols":13,"rows_kept":66,"cut":false,"hidden":true,"merged":[]}
["Bezeichnung","Wert",null,null,null,null,null,null,null,59,4,52,13]
["Sprache Spalte",5]
["Sprache","Nederlands",null,null,null,null,null,null,null,"333","SEW","30 / 30","01"]
["DOM-XL Version","DOM-XL 2020 V5.3.1",null,null,null,null,null,null,null,"333SKG2",null,"30 / 35","03"]
["Freispalten",10,null,null,null,null,null,null,null,"333H",null,"30 / 40","04"]
["Preisliste",null,null,null,null,null,null,null,null,"333HSKG2",null,"30 / 45","04-S"]
["1Datei","E:\\Dokumente und Einstellungen\\Spock\\Eigene Dateien\\test.xls",null,null,null,null,null,null,null,"333K6",null,"30 / 50","05"]
["Letztes speichern","15.11.2017 - 15:12:05",null,null,null,null,null,null,null,"333K6SKG2",null,"30 / 55","06"]
["Leser","Keybord",null,null,null,null,null,null,null,"333T",null,"30 / 60","07"]
["SSK Eingabeanschläge","",null,null,null,null,null,null,null,"333TSKG2",null,"35 / 30","09"]
["SSK Anlage","",null,null,null,null,null,null,null,"333FRL",null,"35 / 35","17"]
["SSK Art","HS",null,null,null,null,null,null,null,"333FRLSKG2",null,"35 / 40","25"]
["SSK System","",null,null,null,null,null,null,null,"333M",null,"35 / 45"]
["SSK Ausführung","",null,null,null,null,null,null,null,"333MSKG3",null,"35 / 50"]
["SSK Profil","",null,null,null,null,null,null,null,"333MT",null,"35 / 55"]
["SSK Datum","",null,null,null,null,null,null,null,"333MTSKG3",null,"35 / 60"]
["SSK Schlusselnummer","",null,null,null,null,null,null,null,"333HFRL",null,"40 / 30"]
["SSK Hersteller","",null,null,null,null,null,null,null,"333HFRLSKG2",null,"40 / 35"]
["SSK Datum 2","",null,null,null,null,null,null,null,"333MH",null,"40 / 40"]
["SSK",null,null,null,null,null,null,null,null,"333MHSKG3",null,"40 / 45"]
["SSK eingelesen am",null,null,null,null,null,null,null,null,"333K1",null,"40 / 50"]
["SSK String",null,null,null,null,null,null,null,null,"333K1SKG2",null,"40 / 55"]
["SSK input","Tastatur-Schnittstelle",null,null,null,null,null,null,null,"333K2",null,"40 / 60"]
["Multi zwischenspeichern",100,100,null,null,null,null,null,null,"333K2SKG2",null,"45 / 30"]
["BAZ",0,30,null,null,null,null,null,null,"333K3",null,"45 / 35"]
["Altzuschlag",0,0,null,null,null,null,null,null,"333K3SKG2",null,"45 / 40"]
["Zuschlag 1",0,0,null,null,null,null,null,null,"333K4",null,"45 / 45"]
["Zuschlag 2",0,0,null,null,null,null,null,null,"333K4SKG2",null,"45 / 50"]
["Abschlag 1",0,0,null,null,null,null,null,null,"333K7",null,"45 / 55"]
["Abschlag 2",0,0,null,null,null,null,null,null,"333K7SKG2",null,"45 / 60"]
["Mehrwertsteuer",0,21,null,null,null,null,null,null,"333K6KRU",null,"50 / 30"]
["Anlagennummer","ID898989",null,null,null,null,null,null,null,"333MK6",null,"50 / 35"]
["System","RS8",null,null,null,null,null,null,null,"333MK6SKG3",null,"50 / 40"]
["Anlagenart","GHS",null,null,null,null,null,null,null,"333MK1SKG3",null,"50 / 45"]
["Ergebnis",170.69,null,null,null,null,null,null,null,"333MK2SKG3",null,"50 / 50"]
["Alle Positionen berechnen","J",null,null,null,null,null,null,null,"333MK3SKG3",null,"50 / 55"]
["Passwort",4711,null,null,null,null,null,null,null,"333MK4SKG3",null,"50 / 60"]
["Meldung Schl/Zyl >9","J",null,null,null,null,null,null,null,"333MK7",null,"55 / 30"]
["Betreiber","",null,null,null,null,null,null,null,"333MK7SKG3",null,"55 / 35"]
["TAC","",null,null,null,null,null,null,null,"333KL",null,"55 / 40"]
["TACS","",null,null,null,null,null,null,null,"333KLK6",null,"55 / 45"]
["SMPT","0",null,null,null,null,null,null,null,"333KLT",null,"55 / 50"]
["SMTPHOST",null,null,null,null,null,null,null,null,"333RI-10",null,"55 / 55"]
["SMTPPort",null,null,null,null,null,null,null,null,"333RI-14",null,"55 / 60"]
["SMTPKonto",null,null,null,null,null,null,null,null,"472",null,"60 / 30"]
["SMPTPW",null,null,null,null,null,null,null,null,"472H",null,"60 / 35"]
["POP3","0",null,null,null,null,null,null,null,"472K6",null,"60 / 40"]
["POP3HOST",null,null,null,null,null,null,null,null,"555P",null,"60 / 45"]
["POP3Port",null,null,null,null,null,null,null,null,"777G3",null,"60 / 50"]
["POP3Konto",null,null,null,null,null,null,null,null,"777G3-HB60",null,"60 / 55"]
["SMPTPW",null,null,null,null,null,null,null,null,"777G3-HB120",null,"60 / 60"]
["MAIL",null,null,null,null,null,null,null,null,"382LI"]
["Multi 2",0,100,null,null,null,null,null,null,"382RE"]
["Multi 3",0,100,null,null,null,null,null,null,"393"]
["Aufpreis Z",30.4,null,null,null,null,null,null,null,"3020/473"]
["Aufpreis HS",39,null,null,null,null,null,null,null,"3020/473 ESP"]
["Aufpreis GHS",68.7,null,null,null,null,null,null,null,"3020/4015"]
["Aufpreis Z halb",25,null,null,null,null,null,null,null,"3020/4015 ESP"]
["Aufpreis HS halb",31.2]
["Aufpreis GHS halb",54.7]
["Multi ELS",100,100]
["System"]
["Anlagenart"]
["NeuErw","N"]
["Anlagennummer"]
["Version",6]